{"text_format":"2","workbook":"xlsx","n_sheets":10,"sheets":["填写信息","托运单A","托运单B","托运单C","运抵报告","舱单信息","纸质舱单","EXT01","EXT02","EXT03"],"not_rendered":{"charts":0,"images":0,"macros":0,"external_links":0,"defined_names":4,"comments":0,"pivot_tables":0},"unopened":[],"bounds":{"document_bytes":16777216,"sheet_cells":100000,"run_cost":"one","rows_first":2000,"rows_last":500,"rows_between":2000,"halvings":0,"cell_chars":16384,"cell_head_chars":4096},"cells_cut":0,"cells_raw":0,"read":"whole","date_system":"1900"}

{"sheet":"填写信息","index":0,"n_rows":250,"n_cols":84,"rows_kept":250,"cut":false,"hidden":false,"merged":[]}
["Version: 2020.3.31","只填本页，务必确保数据与报关单一致","注: 黏贴数据请对单元格点鼠标右键->黏贴数值,不要直接CTRL+V",{"$nulls":6},"20PF"]
["最新模板下载地址:","http://pan.baidu.com/s/1miubi9U",{"$nulls":7},"40PF",{"$nulls":4},{"$f":"ISERROR(MATCH(MID(LOWER(B23),1,1),O4:O29,0))","v":false},{"$nulls":20},{"$f":"LOOKUP(1,0/FIND(UPPER(B13),AK2:AK270),AK2:AK270)","v":"UNITED KINGDOM(英国)"},"AFGHANISTAN(阿富汗)","AF"]
["提单号: ","156000888887",null,"是否需打印红单:  ","是",{"$nulls":4},"20FR",{"$f":"IF(TRIM(B5)=\"\",\"\",INDEX(AL:AL,MATCH(K5,AK:AK,0)))","v":"CN"},null,{"$f":"IF(AND(N4,N5,N6,N7,N8,N9,N10,N11,N12,N13,N14,N15,N16,N17,N18,N19,N20,N21)=TRUE,TRUE, FALSE)","v":true},"下一行判断标点是否存在","字母","对号",{"$nulls":19},{"$f":"VLOOKUP(\"*\"&UPPER(B13)&\"*\",AK2:AK270,1,)","v":"UNITED KINGDOM(英国)"},"ALBANIA(阿尔巴尼亚)","AL",{"$nulls":45},"是"]
["授权办单公司: ","XXXX货运代理有限公司",null,"提柜模式:  ","拖装",{"$nulls":4},"40FR","重名国家检测:",{"$f":"COUNT(FIND(B5,AK$2:AK$270))","v":1},",",{"$f":"ISERROR(FIND(M4,B$23))","v":true},"a",10,null,1,{"$nulls":18},"ALGERIA(阿尔及利亚)","DZ",{"$nulls":45},"否"]
["发货人企业注册国家: ","中国",{"$f":"IF(B5=\"\",\"签订贸易合同企业的注册国家\",IF(L4=1,K5,\"存在重名国家: \"&LEFT(K5,19)&\".. // \"&LEFT(K6,19)&\"..\"))","v":"CHINA(中国)"},{"$nulls":6},"45GP",{"$f":"VLOOKUP(\"*\"&UPPER(B5)&\"*\",AK$2:AK$270,1,)","v":"CHINA(中国)"},null,".",{"$f":"ISERROR(FIND(M5,B$23))","v":true},"b",12,null,2,{"$nulls":18},"AMERICA(美国)","US",{"$nulls":45},"场内装"]
["发货人: ","BBBB有限公司","(请填写发货人全称)",{"$nulls":6},"20HC",{"$f":"LOOKUP(1,0/FIND(UPPER(B5),AK$2:AK$270),AK$2:AK$270)","v":"CHINA(中国)"},null,";",true,"c",13,null,3,null,1,2,3,4,5,6,7,8,9,{"$nulls":8},"SAMOA(美属)","AS",{"$nulls":45},"拖装"]
["发货人代码: ","91440XXXXXXXXXXXXX","(请填写统一信用代码)",{"$nulls":6},"45HC",null,null,":",true,"d",14,null,4,null,{"$f":"IF(ISNUMBER(MID($B9,T$6,1)+1-1),MID($B9,T$6,1),\"\")","v":"1"},"3","8","0","9","7","5","","",{"$f":"T7&U7&V7&W7&X7&Y7&Z7&AA7&AB7","v":"1380975"},{"$f":"IF(ISERROR(AC7+1-1),\"\",IF(FIND(AC7,B9)>0,AC7+1-1,\"\"))","v":1380975},{"$nulls":6},"ANDORRA(安道尔)","AD",{"$nulls":45},"吉出不回"]
["发货人地址: ","广东省湛江市xxx区xxx街道888号","(省.市.区.街道.门牌号)",{"$nulls":6},"20OT",null,null,"(",true,"e",15,null,5,{"$nulls":18},"ANGOLA(安哥拉)","AO",{"$nulls":45},"吉柜进场"]
["发货人电话: ","1380975XXXX","(请提供联系电话)",{"$nulls":6},"40OT",null,null,"-",true,"f",16,null,6,{"$nulls":18},"ANGUILLA(安圭拉)","AI",{"$nulls":45},"海铁联运"]
["发货人具体联系人: ","SOMEBODY","(发货人具体联系人)",{"$nulls":6},"20TK",{"$f":"IF(TRIM(B13)=\"\",\"\",INDEX(AL:AL,MATCH(K13,AK:AK,0)))","v":"GB"},null,"~",true,"g",17,null,7,null,1,2,3,4,5,6,7,8,9,{"$nulls":8},"ANTARCTICA","AQ"]
["报关行及联系电话: ",null,"(请提供联系手机)",{"$nulls":6},"40TK",null,null,"#",true,"h",18,null,8,null,{"$f":"IF(ISNUMBER(MID($B32,T$6,1)+1-1),MID($B32,T$6,1),\"\")","v":""},"","","","7","","","","",{"$f":"T11&U11&V11&W11&X11&Y11&Z11&AA11&AB11","v":"7"},{"$f":"IF(ISERROR(AC11+1-1),\"\",AC11+1-1)","v":7},{"$nulls":6},"ANTIGUA AND BARBUDA(安提瓜和巴布达)","AG"]
[{"$nulls":9},"40UT","重名国家检测:",{"$f":"COUNT(FIND(B13,AK$2:AK$270))","v":1},"、",true,"i",19,null,9,{"$nulls":18},"ARGENTINA(阿根廷)","AR"]
["收货人企业注册国家: ","英国",{"$f":"IF(B13=\"\",\"签订贸易合同企业的注册国家\",IF(L12=1,K13,\"存在重名国家: \"&LEFT(K13,19)&\".. // \"&LEFT(K14,19)&\"..\"))","v":"UNITED KINGDOM(英国)"},{"$nulls":6},"40RH",{"$f":"VLOOKUP(\"*\"&UPPER(B13)&\"*\",AK$2:AK$270,1,)","v":"UNITED KINGDOM(英国)"},null,"/",true,"j",20,null,10,{"$nulls":18},"ARMENIA(亚美尼亚)","AM"]
["收货人: ","BBC CO.LTD","(请填写收货人全称)",{"$nulls":6},"40RQ",{"$f":"LOOKUP(1,0/FIND(UPPER(B13),AK$2:AK$270),AK$2:AK$270)","v":"UNITED KINGDOM(英国)"},null,"，",true,"k",21,null,11,null,1,2,3,4,5,6,7,8,9,{"$nulls":8},"ARUBA(阿鲁巴)","AW"]
["收货人代码: ","80808XXXXXXX","(请填写注册代码)",{"$nulls":9},"。",true,"l",23,null,12,null,{"$f":"IF(ISNUMBER(MID($B14,T$6,1)+1-1),MID($B14,T$6,1),\"\")","v":""},"","","","","","","","",{"$f":"T15&U15&V15&W15&X15&Y15&Z15&AA15&AB15","v":""},{"$f":"IF(ISERROR(AC15+1-1),\"\",AC15+1-1)","v":""},{"$nulls":6},"AUSTRALIA(澳大利亚)","AU"]
["收货人地址: ","COUNTRY.STATE.CITY.DISTRICT.001","(国家,省/州/市.区.街道.门牌号)",{"$nulls":7},"20RF",null,"；",true,"m",24,null,13,{"$nulls":18},"AUSTRIA(奥地利)","AT"]
["收货人电话: ","886-886-886","(请提供联系电话)",{"$nulls":7},"20RH",null,"：",true,"n",25,null,14,{"$nulls":18},"AZERBAIJAN(阿塞拜疆)","AZ"]
["收货人具体联系人: ","SOMEBODY","(收货人具体联系人)",{"$nulls":9},"（",true,"o",26,null,15,null,1,2,3,4,5,6,7,8,9,{"$nulls":8},"BAHAMAS(巴哈尔)","BS"]
[{"$nulls":9},"下一行货名合并",null,null,"——",true,"p",27,null,16,null,{"$f":"IF(ISNUMBER(MID($B17,T$6,1)+1-1),MID($B17,T$6,1),\"\")","v":"8"},"8","6","","8","8","6","","8",{"$f":"T19&U19&V19&W19&X19&Y19&Z19&AA19&AB19","v":"8868868"},{"$f":"IF(ISERROR(AC19+1-1),\"\",AC19+1-1)","v":8868868},{"$nulls":6},"BAHRAIN(巴林)","BH"]
["英文船名：","UNI-ACCORD","IMO可参阅:","http://pan.baidu.com/s/1miubi9U",{"$nulls":5},{"$f":"J26&J27&J28&J29&J30&J31&J32&J33&J34&J35&J36&J37&J38&J39&J40&J41&J42&J43&J44&J45&J46&J47&J48&J49&J50&J51&J52&J53&J54&J55&J56&J57&J58&J59&J60&J61&J62&J63&J64&J65&J66&J67&J68&J69&J70&J71&J72&J73&J74&J75","v":"测试货名1 [,](100[,]CTNS[,]18000KGS)[|]测试货名2 [,](100[,]PACKAGES[,]1200KGS)[|]测试货名3 [,](100[,]REEL[,]1200KGS)[|]测试货名4 [,](100[,]BAGS[,]1200KGS)[|]测试货名5 [,](100[,]BRAID[,]1200KGS)[|]测试货名6 [,](100[,]BAGS[,]1200KGS)[|]测试货名7 [,](100[,]BAGS[,]1200KGS)[|]测试货名8 [,](100[,]BAGS[,]1200KGS)[|]测试货名9 [,](100[,]BAGS[,]1200KGS)[|]测试货名10 [,](100[,]BAGS[,]1200KGS)[|]"}," ",null,"+",true,"q",28,null,17,{"$nulls":18},"BANGLADESH(孟加拉国)","BD"]
["航次：","0274519B","(航次只填写英文字符和数字字符)",{"$nulls":6},"货名+件数+包装+毛重合并","重名国家检测:",{"$f":"COUNT(FIND(B22,AK2:AK279))","v":1},"\\",true,"r",29,null,18,{"$nulls":18},"BARBADOS(巴巴多斯)","BB"]
["卸货港所在国: ","JAPAN",{"$f":"IF(B22=\"\",\"报关单中的贸易国\",IF(L21=1,L22,\"存在重名国家: \"&LEFT(L22,19)&\".. // \"&LEFT(L23,19)&\"..\"))","v":"JAPAN(日本)"},{"$nulls":6},{"$f":"J26&J27&J28&J29&J30&J31&J32&J33&J34&J35&J36&J37&J38&J39&J40&J41&J42&J43&J44&J45&J46&J47&J48&J49&J50&J51&J52&J53&J54&J55&J56&J57&J58&J59&J60&J61&J62&J63&J64&J65&J66&J67&J68&J69&J70&J71&J72&J73&J74&J75","v":"测试货名1 [,](100[,]CTNS[,]18000KGS)[|]测试货名2 [,](100[,]PACKAGES[,]1200KGS)[|]测试货名3 [,](100[,]REEL[,]1200KGS)[|]测试货名4 [,](100[,]BAGS[,]1200KGS)[|]测试货名5 [,](100[,]BRAID[,]1200KGS)[|]测试货名6 [,](100[,]BAGS[,]1200KGS)[|]测试货名7 [,](100[,]BAGS[,]1200KGS)[|]测试货名8 [,](100[,]BAGS[,]1200KGS)[|]测试货名9 [,](100[,]BAGS[,]1200KGS)[|]测试货名10 [,](100[,]BAGS[,]1200KGS)[|]"}," ",{"$f":"IF(TRIM(B22)=\"\",\"\",VLOOKUP(\"*\"&UPPER(B22)&\"*\",AK$2:AK$270,1,))","v":"JAPAN(日本)"},{"$f":"IF(TRIM(B22)=\"\",\"\",INDEX(AL:AL,MATCH(L22,AK:AK,0)))","v":"JP"},null,"s",30,null,19,null,1,2,3,4,5,6,7,8,9,{"$nulls":8},"BELARUS(白俄)","BY"]
["卸货港(英文): ","ABCPORT","(请填写英文卸货港)",{"$nulls":6},{"$f":"SUM(C26:C75)","v":1000},"件数总数",{"$f":"LOOKUP(1,0/FIND(UPPER(B22),AK2:AK270),AK2:AK270)","v":"JAPAN(日本)"},null,null,"t",31,null,20,null,{"$f":"IF(ISNUMBER(MID(#REF!,T$6,1)+1-1),MID(#REF!,T$6,1),\"\")","v":""},{"$f":"IF(ISNUMBER(MID(#REF!,U$6,1)+1-1),MID(#REF!,U$6,1),\"\")","v":""},{"$f":"IF(ISNUMBER(MID(#REF!,V$6,1)+1-1),MID(#REF!,V$6,1),\"\")","v":""},{"$f":"IF(ISNUMBER(MID(#REF!,W$6,1)+1-1),MID(#REF!,W$6,1),\"\")","v":""},{"$f":"IF(ISNUMBER(MID(#REF!,X$6,1)+1-1),MID(#REF!,X$6,1),\"\")","v":""},{"$f":"IF(ISNUMBER(MID(#REF!,Y$6,1)+1-1),MID(#REF!,Y$6,1),\"\")","v":""},{"$f":"IF(ISNUMBER(MID(#REF!,Z$6,1)+1-1),MID(#REF!,Z$6,1),\"\")","v":""},{"$f":"IF(ISNUMBER(MID(#REF!,AA$6,1)+1-1),MID(#REF!,AA$6,1),\"\")","v":""},{"$f":"IF(ISNUMBER(MID(#REF!,AB$6,1)+1-1),MID(#REF!,AB$6,1),\"\")","v":""},{"$f":"T23&U23&V23&W23&X23&Y23&Z23&AA23&AB23","v":""},{"$f":"IF(ISERROR(AC23+1-1),\"\",AC23+1-1)","v":""},{"$nulls":6},"BELGIUM(比利时)","BE"]
[{"$nulls":9},{"$f":"ROUND(SUM(E26:E75),3)","v":28800},"毛重总数",null,null,null,"u",32,null,21,{"$nulls":18},"BELIZE(伯利兹)","BZ"]
["序号","货名","件数","包装单位","毛重(KGS)",{"$nulls":4},{"$f":"IF(SUM(K26:K75)=1,D26,\"件\")","v":"件"},"件数单位判断",null,null,null,"v",34,null,22,{"$nulls":18},"BENIN(贝宁)","BJ"]
[1,"测试货名1",100,"CTNS",18000,{"$nulls":4},{"$f":"IF(TRIM(B26)<>\"\",B26&\" [,](\"&C26&\"[,]\"&D26&\"[,]\"&E26&\"KGS)[|]\",\"\")","v":"测试货名1 [,](100[,]CTNS[,]18000KGS)[|]"},{"$f":"IF(AND(D26<>D25,B26<>\"\"),1,0)","v":1},null,null,null,"w",35,null,23,null,1,2,3,4,5,6,7,8,9,{"$nulls":8},"BERMUDA(百慕大群岛)","BM"]
[2,"测试货名2",100,"PACKAGES",1200,{"$nulls":4},{"$f":"IF(TRIM(B27)<>\"\",B27&\" [,](\"&C27&\"[,]\"&D27&\"[,]\"&E27&\"KGS)[|]\",\"\")","v":"测试货名2 [,](100[,]PACKAGES[,]1200KGS)[|]"},{"$f":"IF(AND(D27<>D26,B27<>\"\"),1,0)","v":1},null,null,null,"x",36,null,24,null,{"$f":"IF(ISNUMBER(MID(#REF!,T$6,1)+1-1),MID(#REF!,T$6,1),\"\")","v":""},{"$f":"IF(ISNUMBER(MID(#REF!,U$6,1)+1-1),MID(#REF!,U$6,1),\"\")","v":""},{"$f":"IF(ISNUMBER(MID(#REF!,V$6,1)+1-1),MID(#REF!,V$6,1),\"\")","v":""},{"$f":"IF(ISNUMBER(MID(#REF!,W$6,1)+1-1),MID(#REF!,W$6,1),\"\")","v":""},{"$f":"IF(ISNUMBER(MID(#REF!,X$6,1)+1-1),MID(#REF!,X$6,1),\"\")","v":""},{"$f":"IF(ISNUMBER(MID(#REF!,Y$6,1)+1-1),MID(#REF!,Y$6,1),\"\")","v":""},{"$f":"IF(ISNUMBER(MID(#REF!,Z$6,1)+1-1),MID(#REF!,Z$6,1),\"\")","v":""},{"$f":"IF(ISNUMBER(MID(#REF!,AA$6,1)+1-1),MID(#REF!,AA$6,1),\"\")","v":""},{"$f":"IF(ISNUMBER(MID(#REF!,AB$6,1)+1-1),MID(#REF!,AB$6,1),\"\")","v":""},{"$f":"T27&U27&V27&W27&X27&Y27&Z27&AA27&AB27","v":""},{"$f":"IF(ISERROR(AC27+1-1),\"\",AC27+1-1)","v":""},{"$nulls":6},"BHUTAN(不丹)","BT"]
[3,"测试货名3",100,"REEL",1200,{"$nulls":4},"测试货名3 [,](100[,]REEL[,]1200KGS)[|]",1,null,null,null,"y",37,null,25,{"$nulls":18},"BOLIVIA(玻利维亚)","BO"]
[4,"测试货名4",100,"BAGS",1200,{"$nulls":4},"测试货名4 [,](100[,]BAGS[,]1200KGS)[|]",1,null,null,null,"z",38,null,26,{"$nulls":18},"BOSNIA HERZEGOVINA(波斯尼亚 黑塞哥维那)","BA"]
[5,"测试货名5",100,"BRAID",1200,{"$nulls":4},"测试货名5 [,](100[,]BRAID[,]1200KGS)[|]",1,{"$nulls":8},1,2,3,4,5,6,7,8,9,{"$nulls":8},"BOTSWANA(博兹瓦纳)","BW"]
[6,"测试货名6",100,"BAGS",1200,{"$nulls":4},"测试货名6 [,](100[,]BAGS[,]1200KGS)[|]",1,{"$nulls":8},{"$f":"IF(ISNUMBER(MID(#REF!,T$6,1)+1-1),MID(#REF!,T$6,1),\"\")","v":""},{"$f":"IF(ISNUMBER(MID(#REF!,U$6,1)+1-1),MID(#REF!,U$6,1),\"\")","v":""},{"$f":"IF(ISNUMBER(MID(#REF!,V$6,1)+1-1),MID(#REF!,V$6,1),\"\")","v":""},{"$f":"IF(ISNUMBER(MID(#REF!,W$6,1)+1-1),MID(#REF!,W$6,1),\"\")","v":""},{"$f":"IF(ISNUMBER(MID(#REF!,X$6,1)+1-1),MID(#REF!,X$6,1),\"\")","v":""},{"$f":"IF(ISNUMBER(MID(#REF!,Y$6,1)+1-1),MID(#REF!,Y$6,1),\"\")","v":""},{"$f":"IF(ISNUMBER(MID(#REF!,Z$6,1)+1-1),MID(#REF!,Z$6,1),\"\")","v":""},{"$f":"IF(ISNUMBER(MID(#REF!,AA$6,1)+1-1),MID(#REF!,AA$6,1),\"\")","v":""},{"$f":"IF(ISNUMBER(MID(#REF!,AB$6,1)+1-1),MID(#REF!,AB$6,1),\"\")","v":""},{"$f":"T31&U31&V31&W31&X31&Y31&Z31&AA31&AB31","v":""},{"$f":"IF(ISERROR(AC31+1-1),\"\",AC31+1-1)","v":""},{"$nulls":6},"BRAZIL(巴西)","BR"]
[7,"测试货名7",100,"BAGS",1200,{"$nulls":4},"测试货名7 [,](100[,]BAGS[,]1200KGS)[|]",0,{"$nulls":25},"BRITISH INDIAN OCEAN TERRITORY","IO"]
[8,"测试货名8",100,"BAGS",1200,{"$nulls":4},"测试货名8 [,](100[,]BAGS[,]1200KGS)[|]",0,{"$nulls":25},"BRUNEI DARUSSALAM(文莱)","BN"]
[9,"测试货名9",100,"BAGS",1200,{"$nulls":4},"测试货名9 [,](100[,]BAGS[,]1200KGS)[|]",0,{"$nulls":8},1,2,3,4,5,6,7,8,9,{"$nulls":8},"BULGARIA(保加利亚)","BG"]
[10,"测试货名10",100,"BAGS",1200,{"$nulls":4},"测试货名10 [,](100[,]BAGS[,]1200KGS)[|]",0,{"$nulls":8},{"$f":"IF(ISNUMBER(MID(#REF!,T$6,1)+1-1),MID(#REF!,T$6,1),\"\")","v":""},{"$f":"IF(ISNUMBER(MID(#REF!,U$6,1)+1-1),MID(#REF!,U$6,1),\"\")","v":""},{"$f":"IF(ISNUMBER(MID(#REF!,V$6,1)+1-1),MID(#REF!,V$6,1),\"\")","v":""},{"$f":"IF(ISNUMBER(MID(#REF!,W$6,1)+1-1),MID(#REF!,W$6,1),\"\")","v":""},{"$f":"IF(ISNUMBER(MID(#REF!,X$6,1)+1-1),MID(#REF!,X$6,1),\"\")","v":""},{"$f":"IF(ISNUMBER(MID(#REF!,Y$6,1)+1-1),MID(#REF!,Y$6,1),\"\")","v":""},{"$f":"IF(ISNUMBER(MID(#REF!,Z$6,1)+1-1),MID(#REF!,Z$6,1),\"\")","v":""},{"$f":"IF(ISNUMBER(MID(#REF!,AA$6,1)+1-1),MID(#REF!,AA$6,1),\"\")","v":""},{"$f":"IF(ISNUMBER(MID(#REF!,AB$6,1)+1-1),MID(#REF!,AB$6,1),\"\")","v":""},{"$f":"T35&U35&V35&W35&X35&Y35&Z35&AA35&AB35","v":""},{"$f":"IF(ISERROR(AC35+1-1),\"\",AC35+1-1)","v":""},{"$nulls":6},"BURKINA FASO(布基纳法索)","BF"]
[11,{"$nulls":8},"",0,{"$nulls":25},"BURUNDI(布隆迪)","BI"]
[12,{"$nulls":8},"",0,{"$nulls":25},"CAMBODIA(柬埔寨)","KH"]
[13,{"$nulls":8},"",0,{"$nulls":8},1,2,3,4,5,6,7,8,9,{"$nulls":8},"CAMEROON(喀麦隆)","CM"]
[14,{"$nulls":8},"",0,{"$nulls":8},{"$f":"IF(ISNUMBER(MID(#REF!,T$6,1)+1-1),MID(#REF!,T$6,1),\"\")","v":""},{"$f":"IF(ISNUMBER(MID(#REF!,U$6,1)+1-1),MID(#REF!,U$6,1),\"\")","v":""},{"$f":"IF(ISNUMBER(MID(#REF!,V$6,1)+1-1),MID(#REF!,V$6,1),\"\")","v":""},{"$f":"IF(ISNUMBER(MID(#REF!,W$6,1)+1-1),MID(#REF!,W$6,1),\"\")","v":""},{"$f":"IF(ISNUMBER(MID(#REF!,X$6,1)+1-1),MID(#REF!,X$6,1),\"\")","v":""},{"$f":"IF(ISNUMBER(MID(#REF!,Y$6,1)+1-1),MID(#REF!,Y$6,1),\"\")","v":""},{"$f":"IF(ISNUMBER(MID(#REF!,Z$6,1)+1-1),MID(#REF!,Z$6,1),\"\")","v":""},{"$f":"IF(ISNUMBER(MID(#REF!,AA$6,1)+1-1),MID(#REF!,AA$6,1),\"\")","v":""},{"$f":"IF(ISNUMBER(MID(#REF!,AB$6,1)+1-1),MID(#REF!,AB$6,1),\"\")","v":""},{"$f":"T39&U39&V39&W39&X39&Y39&Z39&AA39&AB39","v":""},{"$f":"IF(ISERROR(AC39+1-1),\"\",AC39+1-1)","v":""},{"$nulls":6},"CANADA(加拿大)","CA"]
[15,{"$nulls":8},"",0,{"$nulls":25},"CAPE VERDE(佛得角)","CV"]
[16,{"$nulls":8},"",0,{"$nulls":25},"CAYMAN ISLANDS(开曼群岛)","KY"]
[17,{"$nulls":8},"",0,{"$nulls":25},"CENTRAL AFRICAN REPUBLIC(中非)","CF","CONCORD","CONCORD","UN9012862"]
[18,{"$nulls":8},"",0,{"$nulls":18},{"$f":"SUM(AD27,AD23,AD19,AD15,AD11,AD7,AD31,AD35,AD39)","v":10249850},{"$nulls":6},"CHAD(乍得)","TD","EVER ABLE","EVER ABLE","UN9130509"]
[19,{"$nulls":8},"",0,{"$nulls":25},"CHILE(智利)","CL","EVER ALLY","EVER ALLY","UN9130511",{"$nulls":4},{"$f":"B90+B93","v":0}]
[20,{"$nulls":8},"",0,{"$nulls":25},"CHINA(中国)","CN","EVER APEX","EVER APEX","UN9130523",{"$nulls":4},{"$f":"B91+B92+B94","v":2}]
[21,{"$nulls":8},"",0,{"$nulls":25},"CHRISTMAS ISLAND","CX","UNI-ACCORD","UNI-ACCORD","UN9130535"]
[22,{"$nulls":8},"",0,{"$nulls":25},"COCOS (KEELING) ISLANDS","CC","UNI-AHEAD","UNI-AHEAD","UN9143348",null,null,1,"ONE",{"$f":"IF(B90=\"\",\"\",IF(SUM(AY48:AY$51)>0,VLOOKUP(B90,AR$47:AS$145,2,FALSE)&AU47&AX47&\" AND \",VLOOKUP(B90,AR$47:AS$145,2,FALSE)&AU47&AX47))","v":""}," TWENTY FEET CONTAINER",null,null,{"$f":"IF(B90=\"\",\"\",\"(\"&B90&\"X\"&A90&IF(B90<AT44,\"\",\")\"))","v":""},{"$f":"IF(AT47<>\"\",1,0)","v":0}]
[23,{"$nulls":8},"",0,{"$nulls":25},"COLOMBIA(哥伦比亚)","CO","UNI-AMPLE","UNI-AMPLE","UN9143336\n",null,null,2,"TWO",{"$f":"IF(B91=\"\",\"\",IF(SUM(AY49:AY$51)>0,VLOOKUP(B91,AR$47:AS$145,2,FALSE)&AU48&AX48&\" AND \",VLOOKUP(B91,AR$47:AS$145,2,FALSE)&AU48&AX48))","v":"ONE FORTY FEET CONTAINER(1X40GP AND "}," FORTY FEET CONTAINER",null,null,{"$f":"IF(B91=\"\",\"\",\"(\"&B91&\"X\"&A91&IF(B91<AT45,\"\",\")\"))","v":"(1X40GP"},{"$f":"IF(AT48<>\"\",1,0)","v":1}]
[24,{"$nulls":8},"",0,{"$nulls":25},"COMOROS(科摩罗)","KM","UNI-ANGEL","UNI-ANGEL","UN9143350",null,null,3,"THREE",{"$f":"IF(B92=\"\",\"\",IF(SUM(AY50:AY$51)>0,VLOOKUP(B92,AR$47:AS$145,2,FALSE)&AU49&AX49&\" AND \",VLOOKUP(B92,AR$47:AS$145,2,FALSE)&AU49&AX49))","v":"ONE FORTY FEET CONTAINER+1X40HQ)"}," FORTY FEET CONTAINER",null,null,{"$f":"IF(B92=\"\",\"\",IF(B91<>0,\"+\",\"(\")&B92&\"X\"&A92&IF(B94<>0,\"\",\")\"))","v":"+1X40HQ)"},{"$f":"IF(AT49<>\"\",1,0)","v":1}]
[25,{"$nulls":8},"",0,{"$nulls":25},"CONGO(刚果共和国(布))","CG","UNI-ARISE","UNI-ARISE","UN9143362",null,null,4,"FOUR",{"$f":"IF(B93=\"\",\"\",IF(SUM(AY51:AY$51)>0,VLOOKUP(B93,AR$47:AS$145,2,FALSE)&AU50&AX50&\" AND \",VLOOKUP(B93,AR$47:AS$145,2,FALSE)&AU50&AX50))","v":""}," TWENTY FEET CONTAINER",null,null,{"$f":"IF(B93=\"\",\"\",IF(OR(B90<>0,B90<>\"\"),\"+\",\"(\")&B93&\"X\"&A93&\")\")","v":""},{"$f":"IF(AT50<>\"\",1,0)","v":0}]
[26,{"$nulls":8},"",0,{"$nulls":25},"CONGO(刚果民主共和国(金)), THE DEMOCRATIC REPUBLIC OF ","CD","UNI-ASPIRE","UNI-ASPIRE","UN9130573",null,null,5,"FIVE",{"$f":"IF(B94=\"\",\"\",VLOOKUP(B94,AR$47:AS$145,2,FALSE)&AU51&AX51)","v":""}," FORTY FEET CONTAINER",null,null,{"$f":"IF(B94=\"\",\"\",IF(OR(B91<>0,B92<>0),\"+\",\"(\")&B94&\"X\"&A94&\")\")","v":""},{"$f":"IF(AT51<>\"\",1,0)","v":0}]
[27,{"$nulls":8},"",0,{"$nulls":25},"COOK ISLANDS","CK","UNI-ASSURE","UNI-ASSURE","UN9130597",null,null,6,"SIX"]
[28,{"$nulls":8},"",0,{"$nulls":25},"COSTA RICA(哥斯达黎加)","CR","UNI-CHART","UNI-CHART","UN9012848",null,null,7,"SEVEN"]
[29,{"$nulls":8},"",0,{"$nulls":25},"COTE DIVOIRE(科特迪瓦)","CI","UNI-CONCERT","UNI-CONCERT","UN9012874",null,null,8,"EIGHT"]
[30,{"$nulls":8},"",0,{"$nulls":25},"CROATIA(克罗地亚)","HR","UNI-CROWN","UNI-CROWN","UN9012836",null,null,9,"NINE",{"$f":"IF(OR(AT44=0,AT44=\"\"),\"\",VLOOKUP(AT44,AR$47:AS$145,2,FALSE)&\" TWENTY FEET CONTAINER\"&AX47&AX50&IF(OR(AT45=0,AT45=\"\"),\"\",\"   AND   \"))","v":""}]
[31,{"$nulls":8},"",0,{"$nulls":25},"CUBA(古巴)","CU","UNI-PROSPER","UNI-PROSPER","UN9202247",null,null,10,"TEN",{"$f":"IF(OR(AT45=0,AT45=\"\"),\"\",VLOOKUP(AT45,AR$47:AS$145,2,FALSE)&\" FORTY FEET CONTAINER\"&AX48&AX49&AX51)","v":"TWO FORTY FEET CONTAINER(1X40GP+1X40HQ)"}]
[32,{"$nulls":8},"",0,{"$nulls":25},"CYPRUS(塞浦路斯)","CY",{"$nulls":5},11,"ELEVEN"]
[33,{"$nulls":8},"",0,{"$nulls":25},"CZECH REPUBLIC(捷克)","CZ","海隆9号","HAI LONG 9 HAO","5730550032",null,null,12,"TWELVE"]
[34,{"$nulls":8},"",0,{"$nulls":25},"DENMARK(丹麦)","DK","海隆228","HAI LONG 228","5730550039",null,null,13,"THIRTEEN"]
[35,{"$nulls":8},"",0,{"$nulls":25},"DJIBOUTI(吉布提)","DJ","海隆318","HAI LONG 318","5730550036",null,null,14,"FOURTEEN"]
[36,{"$nulls":8},"",0,{"$nulls":25},"DOMINICA(多米尼克)","DM","海隆628","HAI LONG 628",5740550037,null,null,15,"FIFTEEN"]
[37,{"$nulls":8},"",0,{"$nulls":25},"DOMINICAN REPUBLIC(多米尼加共和国)","DO",{"$nulls":5},16,"SIXTEEN"]
[38,{"$nulls":8},"",0,{"$nulls":25},"ECUADOR(厄瓜多尔)","EC","AJA IPSA","儒春轮 (AJA IPSA)","UN9270804",null,null,17,"SEVENTEEN"]
[39,{"$nulls":8},"",0,{"$nulls":25},"EGYPT(埃及)","EG","ARUNA IPSA","茹春轮 (ARUNA IPSA)","UN9270828",null,null,18,"EIGHTEEN"]
[40,{"$nulls":8},"",0,{"$nulls":25},"EL SALVADOR(萨尔瓦多)","SV","AS FIONA","瑶春(AS FIONA)","UN9248930",null,null,19,"NINETEEN"]
[41,{"$nulls":8},"",0,{"$nulls":25},"EQUATORIAL GUINEA(赤道几内亚)","GQ","AS FRIDA","顾春轮(AS FRIDA)","UN9248928",null,null,20,"TWENTY"]
[42,{"$nulls":8},"",0,{"$nulls":25},"ERITREA(厄立特里亚)","ER","AS ROBERTA","咨春轮(AS ROBERTA)","UN9330903",null,null,21,"TWENTY-ONE"]
[43,{"$nulls":8},"",0,{"$nulls":25},"ESTONIA(爱莎尼亚)","EE","ASIA IPSA","焕春轮 (ASIA IPSA)","UN9270816",null,null,22,"TWENTY-TWO"]
[44,{"$nulls":8},"",0,{"$nulls":25},"ETHIOPIA(埃塞俄比亚)","ET","EL ZORRO","洛春輪 (EL ZORRO)","UN9347968",null,null,23,"TWENTY-THREE"]
[45,{"$nulls":8},"",0,{"$nulls":25},"FALKLAND ISLANDS (MALVINAS)","FK","MAENAM 1","川春輪 (MAENAM 1)","UN9159086",null,null,24,"TWENTY-FOUR"]
[46,{"$nulls":8},"",0,{"$nulls":25},"FAROE ISLANDS(法罗群岛)","FO","ONYX 1","寺春輪(ONYX 1)","UN9270804",null,null,25,"TWENTY-FIVE"]
[47,{"$nulls":8},"",0,{"$nulls":25},"FIJI(斐济)","FJ","ONYX 1","寺春輪(ONYX 1)","UN9270804",null,null,26,"TWENTY-SIX"]
[48,{"$nulls":8},"",0,{"$nulls":25},"FINLAND(芬兰)","FI","PRINCESS OF LUCK","妃春輪 (PRINCESS OF LUCK)","UN9159842",null,null,27,"TWENTY-SEVEN"]
[49,{"$nulls":8},"",0,{"$nulls":25},"FRANCE(法国)","FR","SIAM 1","尚春輪 (SIAM 1)","UN9140061",null,null,28,"TWENTY-EIGHT"]
[50,{"$nulls":8},"",0,{"$nulls":25},"FRENCH GUIANA","GF","WAN HAI 101","远春轮 (WAN HAI 101)","UN9493298",null,null,29,"TWENTY-NINE"]
[{"$nulls":9},"",0,{"$nulls":25},"FRENCH POLYNESIA","PF","WAN HAI 102","見春輪 (WAN HAI 102)","UN9493303",null,null,30,"THIRTY"]
[{"$nulls":9},"",0,{"$nulls":25},"GABON(加蓬)","GA","WAN HAI 103","昇春輪 (WAN HAI 103)","UN9596349",null,null,31,"THIRTY-ONE"]
[{"$nulls":9},"",0,{"$nulls":25},"GAMBIA(冈比亚)","GM","WAN HAI 173","詠春輪 (WAN HAI 173)","UN9350147",null,null,32,"THIRTY-TWO"]
[{"$nulls":9},"",0,{"$nulls":25},"GEORGIA(格鲁吉亚)","GE","WAN HAI 203","長春輪 (WAN HAI 203)","UN8914013",null,null,33,"THIRTY-THREE"]
[{"$nulls":9},"",0,{"$nulls":25},"GERMANY(德国)","DE","WAN HAI 216","WAN HAI 216","UN9059145",null,null,34,"THIRTY-FOUR"]
[{"$nulls":9},"",0,{"$nulls":25},"GHANA(加纳)","GH","WAN HAI 231","裕春輪 (WAN HAI 231)","UN9208150",null,null,35,"THIRTY-FIVE"]
[{"$nulls":9},"",0,{"$nulls":25},"GIBRALTAR(直布罗陀)","GI","WAN HAI 282","合春轮 (WAN HAI 282)","UN9182021",null,null,36,"THIRTY-SIX"]
[{"$nulls":9},"",0,{"$nulls":25},"GREECE(希腊)","GR","WHITE DRAGON","龙春轮(WHITE DRAGON)","UN9412816",null,null,37,"THIRTY-SEVEN"]
[{"$nulls":9},"",0,{"$nulls":25},"GREENLAND(格陵兰)","GL",{"$nulls":5},38,"THIRTY-EIGHT"]
[{"$nulls":36},"GRENADA(格林纳达)","GD",{"$nulls":5},39,"THIRTY-NINE"]
["温度(冻柜专用): ",null,"(若货物是冻柜需填写设定温度)",{"$nulls":33},"GUADELOUPE","GP","临海109","LIN HAI 109","6401550005",null,null,40,"FORTY"]
["危险品编号: ",null,"(若货物是危险品需填写危险品编号)",{"$nulls":33},"GUAM","GU","ZENIT","ZENIT","UN9127813",null,null,41,"FORTY-ONE"]
[{"$nulls":9},"FCL",{"$nulls":26},"GUATEMALA(危地马拉)","GT",{"$nulls":5},42,"FORTY-TWO"]
["柜型","柜数",{"$nulls":7},"LCL",{"$nulls":26},"GUERNSEY(根西岛)","GG","爱奥尼亚(IONIAN EXPRESS)","IONIAN EXPRESS","UN9332717",null,null,43,"FORTY-THREE"]
["20GP",{"$nulls":35},"GUINEA(几内亚)","GN","超勇(MAX COURAGE)","MAX COURAGE","UN9378931",null,null,44,"FORTY-FOUR"]
["40GP",1,{"$nulls":34},"GUINEA-BISSAU(几内亚比绍)","GW","意达(ITALIAN EXPRESS)","ITALIAN EXPRESS","UN9474395",null,null,45,"FORTY-FIVE"]
["40HQ",1,{"$nulls":34},"GUYANA(圭亚那)","GY","穆勒阿斯特(FRISIA ALSTER)","FRISIA ALSTER","UN9434797",null,null,46,"FORTY-SIX"]
["20RF",{"$nulls":35},"HAITI(海地)","HT","BINDI IPSA","BINDI IPSA","UN9593517",null,null,47,"FORTY-SEVEN"]
["40RH",{"$nulls":35},"HEARD ISLAND AND MCDONALD ISLANDS","HM",{"$nulls":5},48,"FORTY-EIGHT"]
[{"$nulls":12},"FCL总数:",{"$f":"SUM(N97:N238)","v":0},{"$nulls":22},"HOLY SEE (VATICAN CITY STATE)(梵蒂冈)","VA","MIYUNHE","MIYUNHE","UN9228772",null,null,49,"FORTY-NINE"]
["柜号","封条","柜型","FCL/LCL",{"$nulls":6},"柜号","位数","验证结果","FCL问题",{"$f":"SUM(O97:O156)","v":1},{"$nulls":21},"HONDURAS(洪都拉斯)","HN","CAIYUNHE","CAIYUNHE","UN9228758",null,null,50,"FIFTY"]
["ABCD1234560","EMCABC0001","40HQ","FCL",{"$nulls":6},{"$f":"IF(A97=\"\",\"\",LEFT(A97,11))","v":"ABCD1234560"},{"$f":"IF(K97=\"\",\"\",MOD(POWER(2,0)*VLOOKUP(MID(K97,1,1),$O$4:$P$57,2,FALSE)+POWER(2,1)*VLOOKUP(MID(K97,2,1),$O$4:$P$57,2,FALSE)+POWER(2,2)*VLOOKUP(MID(K97,3,1),$O$4:$P$57,2,FALSE)+POWER(2,3)*VLOOKUP(MID(K97,4,1),$O$4:$P$57,2,FALSE)+POWER(2,4)*MID(K97,5,1)+POWER(2,5)*MID(K97,6,1)+POWER(2,6)*MID(K97,7,1)+POWER(2,7)*MID(K97,8,1)+POWER(2,8)*MID(K97,9,1)+POWER(2,9)*MID(K97,10,1),11))","v":10},{"$f":"IF(K97=\"\",\"\",IF(LEN(K97)<>11,\"错误\",IF(OR(VALUE(RIGHT(L97,1))<>VALUE(RIGHT(K97,1)),COUNTIF(K$97:K$126,K97)>1),\"错误\",\"通过\")))","v":"通过"},{"$f":"IF(D97=\"LCL\",1,0)","v":0},{"$f":"IF(M97=\"通过\",1,0)","v":1},{"$nulls":21},"HONG KONG(香港)","HK","CAPE FRANKLIN","CAPE FRANKLIN","UN9359301",null,null,51,"FIFTY-ONE"]
[{"$nulls":10},{"$f":"IF(A98=\"\",\"\",LEFT(A98,11))","v":""},{"$f":"IF(K98=\"\",\"\",MOD(POWER(2,0)*VLOOKUP(MID(K98,1,1),$O$4:$P$57,2,FALSE)+POWER(2,1)*VLOOKUP(MID(K98,2,1),$O$4:$P$57,2,FALSE)+POWER(2,2)*VLOOKUP(MID(K98,3,1),$O$4:$P$57,2,FALSE)+POWER(2,3)*VLOOKUP(MID(K98,4,1),$O$4:$P$57,2,FALSE)+POWER(2,4)*MID(K98,5,1)+POWER(2,5)*MID(K98,6,1)+POWER(2,6)*MID(K98,7,1)+POWER(2,7)*MID(K98,8,1)+POWER(2,8)*MID(K98,9,1)+POWER(2,9)*MID(K98,10,1),11))","v":""},{"$f":"IF(K98=\"\",\"\",IF(LEN(K98)<>11,\"错误\",IF(OR(VALUE(RIGHT(L98,1))<>VALUE(RIGHT(K98,1)),COUNTIF(K$97:K$126,K98)>1),\"错误\",\"通过\")))","v":""},{"$f":"IF(D98=\"LCL\",1,0)","v":0},{"$f":"IF(M98=\"通过\",1,0)","v":0},{"$nulls":21},"HUNGARY(匈牙利)","HU","HANJIN BELAWAN","HANJIN BELAWAN","UN9412828",null,null,52,"FIFTY-TWO"]
[{"$nulls":10},"","","",0,0,{"$nulls":21},"ICELAND(冰岛)","IS",{"$nulls":5},53,"FIFTY-THREE"]
[{"$nulls":10},"","","",0,0,{"$nulls":21},"INDIA(印度)","IN","運達1號 (IAL 001)","IAL 001","UN9140061",null,null,54,"FIFTY-FOUR"]
[{"$nulls":10},"","","",0,0,{"$nulls":21},"INDONESIA(印尼)","ID","陽江河 (YANG JIANG HE)","YANG JIANG HE","UN9146704",null,null,55,"FIFTY-FIVE"]
[{"$nulls":10},"","","",0,0,{"$nulls":21},"INSTALLATIONS IN INTERNATIONAL WAT","XZ","勉春輪 (VAN HARMONY)","VAN HARMONY","UN9241009",null,null,56,"FIFTY-SIX"]
[{"$nulls":10},"","","",0,0,{"$nulls":21},"IRAN, ISLAMIC REPUBLIC OF(伊朗)","IR","HUI JIN QIAO 18","HUI JIN QIAO 18","5338550066",null,null,57,"FIFTY-SEVEN"]
[{"$nulls":10},"","","",0,0,{"$nulls":21},"IRAQ(伊拉克)","IQ","LIN HAI 108","LIN HAI 108","6401550006",null,null,58,"FIFTY-EIGHT"]
[{"$nulls":10},"","","",0,0,{"$nulls":21},"IRELAND(爱尔兰)","IE","长源 8","CHANG YUAN 8","6711550005",null,null,59,"FIFTY-NINE"]
[{"$nulls":10},"","","",0,0,{"$nulls":21},"ISLE OF MAN(马恩岛)","IM","长源 9","Chang Yuan 9","6711550044",null,null,60,"SISTY"]
[{"$nulls":10},"","","",0,0,{"$nulls":21},"ISRAEL(以色列)","IL","辰达","CHEN DA","6401550009",null,null,61,"SISTY-ONE"]
[{"$nulls":10},"","","",0,0,{"$nulls":21},"ITALY(意大利)","IT","惠湾 303","HUI WAN 303","5338550065",null,null,62,"SISTY-TWO"]
[{"$nulls":10},"","","",0,0,{"$nulls":21},"JAMAICA(牙买加)","JM","建功58","JIAN GONG 58","5200550139",null,null,63,"SISTY-THREE"]
[{"$nulls":10},"","","",0,0,{"$nulls":21},"JAPAN(日本)","JP","建功188","JIAN GONG 188","5200500408",null,null,64,"SISTY-FOUR"]
[{"$nulls":10},"","","",0,0,{"$nulls":21},"JERSEY","JE","金龙海","JIN LONG HAI","6711550020",null,null,65,"SISTY-FIVE"]
[{"$nulls":10},"","","",0,0,{"$nulls":21},"JORDAN(约旦)","JO","南航927","NAN HANG 927","6711550040",null,null,66,"SISTY-SIX"]
[{"$nulls":10},"","","",0,0,{"$nulls":21},"KAZAKHSTAN(哈萨克斯坦)","KZ","南鸿 928","NAN HONG 928","6711550035",null,null,67,"SISTY-SEVEN"]
[{"$nulls":10},"","","",0,0,{"$nulls":21},"KENYA(肯尼亚)","KE","南鸿 929","NAN HONG 929","6711550034",null,null,68,"SISTY-EIGHT"]
[{"$nulls":10},"","","",0,0,{"$nulls":21},"KIRIBATI(基里巴斯)","KI","南鸿 933","NAN HONG 933","6711550041",null,null,69,"SISTY-NINE"]
[{"$nulls":10},"","","",0,0,{"$nulls":21},"KOREA(朝鲜), DEMOCRATIC PEOPLE'S REPUBLIC","KP","南鸿 938","NAN HONG 938","6711550053",null,null,70,"SEVENTY"]
[{"$nulls":10},"","","",0,0,{"$nulls":21},"KOREA(韩国), REPUBLIC OF","KR","平野 2","PING YE 2","6020550019",null,null,71,"SEVENTY-ONE"]
[{"$nulls":10},"","","",0,0,{"$nulls":21},"KUWAIT(科威特)","KW","盛河","SHENG HE","9058402",null,null,72,"SEVENTY-TWO"]
[{"$nulls":10},"","","",0,0,{"$nulls":21},"KYRGYZSTAN(吉尔吉斯斯坦)","KG","泰恒 6","TAI HENG 6","6711550030",null,null,73,"SEVENTY-THREE"]
[{"$nulls":10},"","","",0,0,{"$nulls":21},"LAO PEOPLE'S DEMOCRATIC REPUBLIC(老挝)","LA","泰益","TAI YI","6711550030",null,null,74,"SEVENTY-FOUR"]
[{"$nulls":10},"","","",0,0,{"$nulls":21},"LATVIA(拉脱维亚)","LV","艳河","YAN HE","9118111",null,null,75,"SEVENTY-FIVE"]
[{"$nulls":10},"","","",0,0,{"$nulls":21},"LEBANON(黎巴嫩)","LB","粵海 1001","YUE HAI 1001","6711550012",null,null,76,"SEVENTY-SIX"]
[{"$nulls":10},"","","",0,0,{"$nulls":21},"LESOTHO(莱索托)","LS","正华 393","ZHENG HUA 393","5338550092",null,null,77,"SEVENTY-SEVEN"]
[{"$nulls":10},"","","",0,0,{"$nulls":21},"LIBERIA(利比里亚)","LR","中威","ZHONG WEI","6705550000",null,null,78,"SEVENTY-EIGHT"]
[{"$nulls":10},"","","",0,0,{"$nulls":21},"LIBYAN ARAB JAMAHIRIYA(利比亚)","LY","DONG NAN HANG 1","DONG NAN HANG 1","5338550051",null,null,79,"SEVENTY-NINE"]
[{"$nulls":10},"","","",0,0,{"$nulls":21},"LIECHTENSTEIN(列支敦士登)","LI","南航767","NAN HANG 767","6711550060",null,null,80,"EIGHTY"]
[{"$nulls":10},"","","",0,0,{"$nulls":21},"LITHUANIA(立陶宛)","LT","方舟5","方舟5","5304550111",null,null,81,"EIGHTY-ONE"]
[{"$nulls":10},"","","",0,0,{"$nulls":21},"LUXEMBOURG(卢森堡)","LU","南航737","南航737","6711550057",null,null,82,"EIGHTY-TWO"]
[{"$nulls":10},"","","",0,0,{"$nulls":21},"MACAO(澳门)","MO","HUI GANG TONG  39","HUI GANG TONG  39","5338550119",null,null,83,"EIGHTY-THREE"]
[{"$nulls":10},"","","",0,0,{"$nulls":21},"MACEDONIA(马其顿)","MK","HUI HONG 3","HUI HONG 3","5304550176",null,null,84,"EIGHTY-FOUR"]
[{"$nulls":10},"","","",0,0,{"$nulls":21},"MADAGASCAR(马达加斯加)","MG","HUI HAI LONG 219","HUI HAI LONG 219","5338550157",null,null,85,"EIGHTY-FIVE"]
[{"$nulls":10},"","","",0,0,{"$nulls":21},"MALAWI(马拉维)","MW","HUI JIN QIAO 09","HUI JIN QIAO 09","5338550117",null,null,86,"EIGHTY-SIX"]
[{"$nulls":10},"","","",0,0,{"$nulls":21},"MALAYSIA(马来西亚)","MY",{"$nulls":5},87,"EIGHTY-SEVEN"]
[{"$nulls":10},"","","",0,0,{"$nulls":21},"MALDIVES(马尔代夫)","MV",{"$nulls":5},88,"EIGHTY-EIGHT"]
[{"$nulls":10},"","","",0,0,{"$nulls":21},"MALI(马里)","ML",{"$nulls":5},89,"EIGHTY-NINE"]
[{"$nulls":10},"","","",0,0,{"$nulls":21},"MALTA(马耳他)","MT",{"$nulls":5},90,"NINETY"]
[{"$nulls":10},"","","",0,0,{"$nulls":21},"MARSHALL ISLANDS(马绍尔群岛)","MH",{"$nulls":5},91,"NINETY-ONE"]
[{"$nulls":10},"","","",0,0,{"$nulls":21},"MARTINIQUE","MQ",{"$nulls":5},92,"NINETY-TWO"]
[{"$nulls":10},"","","",0,0,{"$nulls":21},"MAURITANIA(毛里塔尼亚)","MR",{"$nulls":5},93,"NINETY-THREE"]
[{"$nulls":10},"","","",0,0,{"$nulls":21},"MAURITIUS(毛里求斯)","MU",{"$nulls":5},94,"NINETY-FOUR"]
[{"$nulls":10},"","","",0,0,{"$nulls":21},"MAYOTTE","YT",{"$nulls":5},95,"NINETY-FIVE"]
[{"$nulls":10},"","","",0,0,{"$nulls":21},"MEXICO(墨西哥)","MX",{"$nulls":5},96,"NINETY-SIX"]
[{"$nulls":10},"","","",0,0,{"$nulls":21},"MICRONESIA, FEDERATED STATES OF(密克罗尼西亚联邦)","FM",{"$nulls":5},97,"NINETY-SEVEN"]
[{"$nulls":10},"","","",0,0,{"$nulls":21},"REPUBLIC OF MOLDOVA(摩尔多瓦)","MD",{"$nulls":5},98,"NINETY-EIGHT"]
[{"$nulls":10},"","","",0,0,{"$nulls":21},"MONACO(摩纳哥)","MC",{"$nulls":5},99,"NINETY-NINE"]
[{"$nulls":10},"","","",0,0,{"$nulls":21},"MONGOLIA(蒙古)","MN"]
[{"$nulls":10},"","","",0,0,{"$nulls":21},"MONTENEGRO(黑山)","ME"]
[{"$nulls":10},"","","",0,0,{"$nulls":21},"MONTSERRAT","MS"]
[{"$nulls":10},"","","",0,0,{"$nulls":21},"MOROCCO(摩洛哥)","MA"]
[{"$nulls":10},"","","",0,0,{"$nulls":21},"MOZAMBIQUE(莫桑比克)","MZ"]
[{"$nulls":10},"","","",0,0,{"$nulls":21},"MYANMAR(缅甸)","MM"]
[{"$nulls":10},"","","",0,0,{"$nulls":21},"NAMIBIA(纳米比亚)","NA"]
[{"$nulls":10},"","","",0,0,{"$nulls":21},"NAURU(瑙鲁)","NR"]
[{"$nulls":10},"","","",0,0,{"$nulls":21},"NEPAL(尼泊尔)","NP"]
[{"$nulls":10},"","","",0,0,{"$nulls":21},"NETHERLANDS(荷兰)","NL"]
[{"$nulls":10},"","","",0,0,{"$nulls":21},"NETHERLANDS ANTILLES(荷属安的列斯群岛)","AN"]
[{"$nulls":10},"","","",0,{"$nulls":22},"NEW CALEDONIA","NC"]
[{"$nulls":10},"","","",0,{"$nulls":22},"NEW ZEALAND(新西兰)","NZ"]
[{"$nulls":10},"","","",0,{"$nulls":22},"NICARAGUA(尼加拉瓜)","NI"]
[{"$nulls":10},"","","",0,{"$nulls":22},"NIGER(尼日尔)","NE"]
[{"$nulls":10},"","","",0,{"$nulls":22},"NIGERIA(尼日利亚)","NG"]
[{"$nulls":10},{"$f":"IF(A162=\"\",\"\",LEFT(A162,11))","v":""},{"$f":"IF(K162=\"\",\"\",MOD(POWER(2,0)*VLOOKUP(MID(K162,1,1),$O$4:$P$57,2,FALSE)+POWER(2,1)*VLOOKUP(MID(K162,2,1),$O$4:$P$57,2,FALSE)+POWER(2,2)*VLOOKUP(MID(K162,3,1),$O$4:$P$57,2,FALSE)+POWER(2,3)*VLOOKUP(MID(K162,4,1),$O$4:$P$57,2,FALSE)+POWER(2,4)*MID(K162,5,1)+POWER(2,5)*MID(K162,6,1)+POWER(2,6)*MID(K162,7,1)+POWER(2,7)*MID(K162,8,1)+POWER(2,8)*MID(K162,9,1)+POWER(2,9)*MID(K162,10,1),11))","v":""},{"$f":"IF(K162=\"\",\"\",IF(LEN(K162)<>11,\"错误\",IF(OR(VALUE(RIGHT(L162,1))<>VALUE(RIGHT(K162,1)),COUNTIF(K$97:K$126,K162)>1),\"错误\",\"通过\")))","v":""},{"$f":"IF(D162=\"LCL\",1,0)","v":0},{"$nulls":22},"NIUE","NU"]
[{"$nulls":10},"","","",0,{"$nulls":22},"NORFOLK ISLAND","NF"]
[{"$nulls":10},"","","",0,{"$nulls":22},"NORTHERN MARIANA ISLANDS","MP"]
[{"$nulls":10},"","","",0,{"$nulls":22},"NORWAY(挪威)","NO"]
[{"$nulls":10},"","","",0,{"$nulls":22},"OMAN(阿曼)","OM"]
[{"$nulls":10},"","","",0,{"$nulls":22},"PAKISTAN(巴基斯坦)","PK"]
[{"$nulls":10},"","","",0,{"$nulls":22},"PALESTINIAN TERRITORY(巴勒斯坦)","PS"]
[{"$nulls":10},"","","",0,{"$nulls":22},"PALAU(帕劳)","PW"]
[{"$nulls":10},"","","",0,{"$nulls":22},"PANAMA(巴拿马)","PA"]
[{"$nulls":10},"","","",0,{"$nulls":22},"PAPUA NEW GUINEA(巴布亚新几内亚)","PG"]
[{"$nulls":10},"","","",0,{"$nulls":22},"PARAGUAY(巴拉圭)","PY"]
[{"$nulls":10},"","","",0,{"$nulls":22},"PERU(秘鲁)","PE"]
[{"$nulls":10},"","","",0,{"$nulls":22},"PHILIPPINES(菲律宾)","PH"]
[{"$nulls":10},"","","",0,{"$nulls":22},"PITCAIRN","PN"]
[{"$nulls":10},"","","",0,{"$nulls":22},"POLAND(波兰)","PL"]
[{"$nulls":10},"","","",0,{"$nulls":22},"PORTUGAL(葡萄牙)","PT"]
[{"$nulls":10},"","","",0,{"$nulls":22},"PUERTO RICO(波多黎各)","PR"]
[{"$nulls":10},"","","",0,{"$nulls":22},"QATAR(卡塔尔)","QA"]
[{"$nulls":10},"","","",0,{"$nulls":22},"REUNION(留尼旺)","RE"]
[{"$nulls":10},"","","",0,{"$nulls":22},"ROMANIA(罗马尼亚)","RO"]
[{"$nulls":10},"","","",0,{"$nulls":22},"RUSSIAN FEDERATION(俄罗斯Russia)","RU"]
[{"$nulls":10},"","","",0,{"$nulls":22},"RWANDA(卢旺达)","RW"]
[{"$nulls":10},"","","",0,{"$nulls":22},"SAINT HELENA","SH"]
[{"$nulls":10},"","","",0,{"$nulls":22},"SAINT KITTS AND NEVIS(圣基茨和尼维斯)","KN"]
[{"$nulls":10},"","","",0,{"$nulls":22},"SAINT LUCIA(圣卢西亚)","LC"]
[{"$nulls":10},"","","",0,{"$nulls":22},"SAINT PIERRE AND MIQUELON","PM"]
[{"$nulls":10},"","","",0,{"$nulls":22},"SAINT VINCENT AND THE GRENADINES(圣文森特和格林纳丁斯)","VC"]
[{"$nulls":10},"","","",0,{"$nulls":22},"SAMOA(萨摩亚群岛)","WS"]
[{"$nulls":10},"","","",0,{"$nulls":22},"SAN MARINO(圣马力诺)","SM"]
[{"$nulls":10},"","","",0,{"$nulls":22},"SAO TOME AND PRINCIPE(圣多美和普林西比)","ST"]
[{"$nulls":10},"","","",0,{"$nulls":22},"SAUDI ARABIA(沙特阿拉伯)","SA"]
[{"$nulls":10},"","","",0,{"$nulls":22},"SENEGAL(塞内加尔)","SN"]
[{"$nulls":10},"","","",0,{"$nulls":22},"SERBIA(塞尔维亚)","RS"]
[{"$nulls":10},"","","",0,{"$nulls":22},"SEYCHELLES(塞舌尔)","SC"]
[{"$nulls":10},"","","",0,{"$nulls":22},"SIERRA LEONE(塞拉利昂)","SL"]
[{"$nulls":10},"","","",0,{"$nulls":22},"SINGAPORE(新加坡)","SG"]
[{"$nulls":10},"","","",0,{"$nulls":22},"SLOVAKIA(斯洛伐克)","SK"]
[{"$nulls":10},"","","",0,{"$nulls":22},"SLOVENIA(斯洛文尼亚)","SI"]
[{"$nulls":10},"","","",0,{"$nulls":22},"SOLOMON ISLANDS(所罗门群岛)","SB"]
[{"$nulls":10},"","","",0,{"$nulls":22},"SOMALIA(索马里)","SO"]
[{"$nulls":10},"","","",0,{"$nulls":22},"SOUTH AFRICA(南非)","ZA"]
[{"$nulls":10},"","","",0,{"$nulls":22},"SOUTH GEORGIA AND THE SOUTH SANDWI","GS"]
[{"$nulls":10},"","","",0,{"$nulls":22},"SPAIN(西班牙)","ES"]
[{"$nulls":10},"","","",0,{"$nulls":22},"SRI LANKA(斯里兰卡)","LK"]
[{"$nulls":10},"","","",0,{"$nulls":22},"SUDAN(苏丹)","SD"]
[{"$nulls":10},"","","",0,{"$nulls":22},"SURINAME(苏里南)","SR"]
[{"$nulls":10},"","","",0,{"$nulls":22},"SVALBARD AND JAN MAYEN","SJ"]
[{"$nulls":10},"","","",0,{"$nulls":22},"SWAZILAND(斯威士兰)","SZ"]
[{"$nulls":10},"","","",0,{"$nulls":22},"SWEDEN(瑞典)","SE"]
[{"$nulls":10},"","","",0,{"$nulls":22},"SWITZERLAND(瑞士)","CH"]
[{"$nulls":10},"","","",0,{"$nulls":22},"SYRIAN ARAB REPUBLIC(叙利亚)","SY"]
[{"$nulls":10},"","","",0,{"$nulls":22},"TAIWAN, PROVINCE OF CHINA(台湾)","TW"]
[{"$nulls":10},"","","",0,{"$nulls":22},"TAJIKISTAN(塔吉克斯坦)","TJ"]
[{"$nulls":10},"","","",0,{"$nulls":22},"TANZANIA, UNITED REPUBLIC OF(坦桑尼亚)","TZ"]
[{"$nulls":10},"","","",0,{"$nulls":22},"THAILAND(泰国)","TH"]
[{"$nulls":10},"","","",0,{"$nulls":22},"TIMOR-LESTE(东帝汶)","TL"]
[{"$nulls":10},"","","",0,{"$nulls":22},"TOGO(多哥)","TG"]
[{"$nulls":10},"","","",0,{"$nulls":22},"TOKELAU","TK"]
[{"$nulls":10},"","","",0,{"$nulls":22},"TONGA(汤加)","TO"]
[{"$nulls":10},"","","",0,{"$nulls":22},"TRINIDAD AND TOBAGO(特立尼达和多巴哥)","TT"]
[{"$nulls":10},"","","",0,{"$nulls":22},"TUNISIA(突尼斯)","TN"]
[{"$nulls":10},"","","",0,{"$nulls":22},"TURKEY(土耳其)","TR"]
[{"$nulls":10},"","","",0,{"$nulls":22},"TURKMENISTAN(土库曼斯坦)","TM"]
[{"$nulls":10},"","","",0,{"$nulls":22},"TURKS AND CAICOS ISLANDS","TC"]
[{"$nulls":10},{"$f":"IF(A226=\"\",\"\",LEFT(A226,11))","v":""},{"$f":"IF(K226=\"\",\"\",MOD(POWER(2,0)*VLOOKUP(MID(K226,1,1),$O$4:$P$57,2,FALSE)+POWER(2,1)*VLOOKUP(MID(K226,2,1),$O$4:$P$57,2,FALSE)+POWER(2,2)*VLOOKUP(MID(K226,3,1),$O$4:$P$57,2,FALSE)+POWER(2,3)*VLOOKUP(MID(K226,4,1),$O$4:$P$57,2,FALSE)+POWER(2,4)*MID(K226,5,1)+POWER(2,5)*MID(K226,6,1)+POWER(2,6)*MID(K226,7,1)+POWER(2,7)*MID(K226,8,1)+POWER(2,8)*MID(K226,9,1)+POWER(2,9)*MID(K226,10,1),11))","v":""},{"$f":"IF(K226=\"\",\"\",IF(LEN(K226)<>11,\"错误\",IF(OR(VALUE(RIGHT(L226,1))<>VALUE(RIGHT(K226,1)),COUNTIF(K$97:K$126,K226)>1),\"错误\",\"通过\")))","v":""},{"$f":"IF(D226=\"LCL\",1,0)","v":0},{"$nulls":22},"TUVALU(图瓦卢)","TV"]
[{"$nulls":10},"","","",0,{"$nulls":22},"UGANDA(乌干达)","UG"]
[{"$nulls":10},"","","",0,{"$nulls":22},"UKRAINE(乌克兰)","UA"]
[{"$nulls":10},"","","",0,{"$nulls":22},"UNITED ARAB EMIRATES(阿拉伯联合酋长国/阿联酋)","AE"]
[{"$nulls":10},"","","",0,{"$nulls":22},"UNITED KINGDOM(英国)","GB"]
[{"$nulls":10},"","","",0,{"$nulls":22},"UNITED STATES","US"]
[{"$nulls":10},"","","",0,{"$nulls":22},"UNITED STATES MINOR OUTLYING ISLAN","UM"]
[{"$nulls":10},"","","",0,{"$nulls":22},"URUGUAY(乌拉圭)","UY"]
[{"$nulls":10},"","","",0,{"$nulls":22},"UZBEKISTAN(乌兹别克)","UZ"]
[{"$nulls":10},"","","",0,{"$nulls":22},"VANUATU(瓦努阿图)","VU"]
[{"$nulls":10},"","","",0,{"$nulls":22},"VENEZUELA(委内瑞拉)","VE"]
[{"$nulls":10},"","","",0,{"$nulls":22},"VIETNAM(越南)","VN"]
[{"$nulls":10},"","","",0,{"$nulls":22},"VIRGIN ISLANDS, BRITISH(英属维尔京群岛)","VG"]
[{"$nulls":36},"VIRGIN ISLANDS, U(美属维尔京群岛)","VI"]
[{"$nulls":36},"WALLIS AND FUTUNA","WF"]
[{"$nulls":36},"WESTERN SAHARA","EH"]
[{"$nulls":36},"YEMEN(也门)","YE"]
[{"$nulls":36},"ZAMBIA(赞比亚)","ZM"]
[{"$nulls":36},"ZIMBABWE(津巴布韦)","ZW"]
[{"$nulls":36},"CURACAO(库拉索)","CW"]
[{"$nulls":36},"EUROPEAN UNION(欧盟)","EL"]
[{"$nulls":36},"KOSOVO(科索沃)","KV"]
[{"$nulls":36},"SINT MAARTEN(圣马丁岛)","SX"]
[{"$nulls":36},"SOUTH SUDAN(南苏丹)","SS"]
[{"$nulls":36},"USA","US"]

{"sheet":"托运单A","index":1,"n_rows":70,"n_cols":25,"rows_kept":70,"cut":false,"hidden":false,"merged":[[1,5,1,6],[17,3,17,4],[22,0,23,0],[38,3,40,5],[22,1,23,3],[24,1,25,3],[22,4,25,5],[24,0,25,0]]}
[]
[]
[{"$f":"填写信息!B6","v":"BBBB有限公司"},null,null,null,"霞山联检",{"$f":"填写信息!B3","v":"156000888887"},{"$nulls":4},"霞山联检"]
[{"$f":"\"          \"&填写信息!B7&\"\"","v":"          91440XXXXXXXXXXXXX"},{"$nulls":9},"霞海联检"]
[{"$nulls":10},"国内转关"]
[]
[{"$f":"填写信息!B14&\" (\"&填写信息!B15&\")\"","v":"BBC CO.LTD (80808XXXXXXX)"}]
[]
[]
[]
[]
[{"$nulls":23},"海隆 318","5730550036"]
[{"$nulls":23},"海隆 9 号","5730550032"]
[{"$nulls":23},"海隆 228","5730550039"]
[{"$nulls":23},"海隆 628","5730550046"]
[{"$nulls":23},"建功188",{"$f":"5200500408&\"\"","v":"5200500408"}]
[{"$f":"TRIM(填写信息!B20)&\" V.\"&填写信息!B21&\" 湛江\"","v":"UNI-ACCORD V.0274519B 湛江"},{"$nulls":5}," ",{"$nulls":16},"中威",{"$f":"6705550000&\"\"","v":"6705550000"}]
[{"$f":"填写信息!B23&\", \"&填写信息!B22","v":"ABCPORT, JAPAN"},{"$nulls":22},"南鸿 933",{"$f":"6711550041&\"\"","v":"6711550041"}]
[{"$nulls":4},"      ",{"$nulls":18},"辰达",{"$f":"6401550009&\"\"","v":"6401550009"}]
[{"$nulls":23},"TAI HENG 6",{"$f":"6711550030&\"\"","v":"6711550030"}]
[{"$nulls":4},"  SHIPPER`S LOAD & COUNT & SEALED",{"$nulls":18},"HUI WAN 303",{"$f":"5338550065&\"\"","v":"5338550065"}]
[{"$nulls":4},{"$f":"A23&\"  S.T.C CY-CY\"","v":"   1X40GP  1X40HQ   FCL  S.T.C CY-CY"},null,null,null,{"$f":"I23<=12","v":true},{"$nulls":9},{"$f":"填写信息!O96","v":1},{"$nulls":4},"YUE HAI 1001",{"$f":"6711550012&\"\"","v":"6711550012"}]
[{"$f":"\" \"&K6&\"  \"&P27&P28&P29&P30&P31&\" \"&IF(填写信息!N95=0,\"FCL\",\"LCL\")","v":"   1X40GP  1X40HQ   FCL"},{"$f":"\"P'kgs(TOTAL): \"&填写信息!J23&填写信息!D26","v":"P'kgs(TOTAL): 1000CTNS"},null,null,{"$f":"TRIM(SUBSTITUTE(SUBSTITUTE(SUBSTITUTE(SUBSTITUTE(填写信息!J22,CHAR(10),\" \"),CHAR(9),\" \"),\"[|]\",CHAR(10)),\"[,]\",\" \"))","v":"测试货名1 (100 CTNS 18000KGS)\n测试货名2 (100 PACKAGES 1200KGS)\n测试货名3 (100 REEL 1200KGS)\n测试货名4 (100 BAGS 1200KGS)\n测试货名5 (100 BRAID 1200KGS)\n测试货名6 (100 BAGS 1200KGS)\n测试货名7 (100 BAGS 1200KGS)\n测试货名8 (100 BAGS 1200KGS)\n测试货名9 (100 BAGS 1200KGS)\n测试货名10 (100 BAGS 1200KGS)\n"},null,null,null,{"$f":"VALUE(填写信息!B90)","v":0},{"$nulls":14},"Chang Yuan 9",{"$f":"6711550044&\"\"","v":"6711550044"}]
[{"$nulls":13},1,{"$nulls":4},{"$f":"IF(填写信息!M97=\"错误\",\"\",IF(填写信息!A97&填写信息!B97=\"\",\"\",填写信息!A97&\"/\"&填写信息!B97&\"/\"&填写信息!C97))","v":"ABCD1234560/EMCABC0001/40HQ"},{"$nulls":4},"JIN LONG HAI",{"$f":"6711550020&\"\"","v":"6711550020"}]
[{"$f":"IF(TRIM(填写信息!B86)=\"\",\"\",\"温度:\"&填写信息!B86)&IF(TRIM(填写信息!B87)=\"\",\"\",\" 危险品编号:\"&填写信息!B87)&\" \"&填写信息!E4","v":" 拖装"},{"$f":"\"G.W(TOTAL): \"&填写信息!J24&\"KGS\"","v":"G.W(TOTAL): 28800KGS"},{"$nulls":11},2,{"$nulls":4},{"$f":"IF(填写信息!M98=\"错误\",\"\",IF(填写信息!A98&填写信息!B98=\"\",\"\",填写信息!A98&\"/\"&填写信息!B98&\"/\"&填写信息!C98))","v":""},{"$nulls":4},"南航927",{"$f":"6711550040&\"\"","v":"6711550040"}]
[{"$nulls":13},3,{"$nulls":4},{"$f":"IF(填写信息!M99=\"错误\",\"\",IF(填写信息!A99&填写信息!B99=\"\",\"\",填写信息!A99&\"/\"&填写信息!B99&\"/\"&填写信息!C99))","v":""},{"$nulls":4},"ZHENG HUA 393",{"$f":"5338550092&\"\"","v":"5338550092"}]
[{"$f":"S24&\"    \"&S34&\"    \"&S44","v":"ABCD1234560/EMCABC0001/40HQ        "},{"$nulls":12},4,"20GP",{"$f":"IF(INDIRECT(\"填写信息!B\"&MATCH(O27,填写信息!A$1:A$94,0))=\"\",\"\",INDIRECT(\"填写信息!B\"&MATCH(O27,填写信息!A$1:A$94,0))&\"X\"&O27&\"  \")","v":""},null,null,{"$f":"IF(填写信息!M100=\"错误\",\"\",IF(填写信息!A100&填写信息!B100=\"\",\"\",填写信息!A100&\"/\"&填写信息!B100&\"/\"&填写信息!C100))","v":""},{"$nulls":4},"SHENG HE",{"$f":"9058402&\"\"","v":"9058402"}]
[{"$f":"S25&\"    \"&S35&\"    \"&S45","v":"        "},{"$nulls":12},5,"40GP",{"$f":"IF(INDIRECT(\"填写信息!B\"&MATCH(O28,填写信息!A$1:A$94,0))=\"\",\"\",INDIRECT(\"填写信息!B\"&MATCH(O28,填写信息!A$1:A$94,0))&\"X\"&O28&\"  \")","v":"1X40GP  "},null,null,{"$f":"IF(填写信息!M101=\"错误\",\"\",IF(填写信息!A101&填写信息!B101=\"\",\"\",填写信息!A101&\"/\"&填写信息!B101&\"/\"&填写信息!C101))","v":""},{"$nulls":4},"YAN HE",{"$f":"9118111&\"\"","v":"9118111"}]
["        ",{"$nulls":12},6,"40HQ",{"$f":"IF(INDIRECT(\"填写信息!B\"&MATCH(O29,填写信息!A$1:A$94,0))=\"\",\"\",INDIRECT(\"填写信息!B\"&MATCH(O29,填写信息!A$1:A$94,0))&\"X\"&O29&\"  \")","v":"1X40HQ  "},null,null,{"$f":"IF(填写信息!M102=\"错误\",\"\",IF(填写信息!A102&填写信息!B102=\"\",\"\",填写信息!A102&\"/\"&填写信息!B102&\"/\"&填写信息!C102))","v":""},{"$nulls":4},"PING YE 2",{"$f":"6020550019&\"\"","v":"6020550019"}]
["        ",{"$nulls":12},7,"20RF",{"$f":"IF(INDIRECT(\"填写信息!B\"&MATCH(O30,填写信息!A$1:A$94,0))=\"\",\"\",INDIRECT(\"填写信息!B\"&MATCH(O30,填写信息!A$1:A$94,0))&\"X\"&O30&\"  \")","v":""},null,null,{"$f":"IF(填写信息!M103=\"错误\",\"\",IF(填写信息!A103&填写信息!B103=\"\",\"\",填写信息!A103&\"/\"&填写信息!B103&\"/\"&填写信息!C103))","v":""}]
["        ",{"$nulls":12},8,{"$f":"填写信息!A94","v":"40RH"},{"$f":"IF(INDIRECT(\"填写信息!B\"&MATCH(O31,填写信息!A$1:A$94,0))=\"\",\"\",INDIRECT(\"填写信息!B\"&MATCH(O31,填写信息!A$1:A$94,0))&\"X\"&O31&\"  \")","v":""},null,null,{"$f":"IF(填写信息!M104=\"错误\",\"\",IF(填写信息!A104&填写信息!B104=\"\",\"\",填写信息!A104&\"/\"&填写信息!B104&\"/\"&填写信息!C104))","v":""}]
["        ",{"$nulls":12},9,{"$nulls":4},{"$f":"IF(填写信息!M105=\"错误\",\"\",IF(填写信息!A105&填写信息!B105=\"\",\"\",填写信息!A105&\"/\"&填写信息!B105&\"/\"&填写信息!C105))","v":""}]
["        ",{"$nulls":12},10,{"$nulls":4},{"$f":"IF(填写信息!M106=\"错误\",\"\",IF(填写信息!A106&填写信息!B106=\"\",\"\",填写信息!A106&\"/\"&填写信息!B106&\"/\"&填写信息!C106))","v":""}]
["        ",{"$nulls":12},11,{"$nulls":4},{"$f":"IF(填写信息!M107=\"错误\",\"\",IF(填写信息!A107&填写信息!B107=\"\",\"\",填写信息!A107&\"/\"&填写信息!B107&\"/\"&填写信息!C107))","v":""}]
["        ",{"$nulls":17},{"$f":"IF(填写信息!M108=\"错误\",\"\",IF(填写信息!A108&填写信息!B108=\"\",\"\",填写信息!A108&\"/\"&填写信息!B108&\"/\"&填写信息!C108))","v":""}]
["        ",{"$nulls":17},{"$f":"IF(填写信息!M109=\"错误\",\"\",IF(填写信息!A109&填写信息!B109=\"\",\"\",填写信息!A109&\"/\"&填写信息!B109&\"/\"&填写信息!C109))","v":""}]
[{"$nulls":18},{"$f":"IF(填写信息!M110=\"错误\",\"\",IF(填写信息!A110&填写信息!B110=\"\",\"\",填写信息!A110&\"/\"&填写信息!B110&\"/\"&填写信息!C110))","v":""}]
[{"$nulls":18},{"$f":"IF(填写信息!M111=\"错误\",\"\",IF(填写信息!A111&填写信息!B111=\"\",\"\",填写信息!A111&\"/\"&填写信息!B111&\"/\"&填写信息!C111))","v":""}]
[null,null,null,{"$f":"\"TOTAL:  \"&填写信息!AT55&填写信息!AT56&\" ONLY\"","v":"TOTAL:  TWO FORTY FEET CONTAINER(1X40GP+1X40HQ) ONLY"},{"$nulls":14},{"$f":"IF(填写信息!M112=\"错误\",\"\",IF(填写信息!A112&填写信息!B112=\"\",\"\",填写信息!A112&\"/\"&填写信息!B112&\"/\"&填写信息!C112))","v":""}]
[{"$nulls":18},{"$f":"IF(填写信息!M113=\"错误\",\"\",IF(填写信息!A113&填写信息!B113=\"\",\"\",填写信息!A113&\"/\"&填写信息!B113&\"/\"&填写信息!C113))","v":""}]
[{"$nulls":18},{"$f":"IF(填写信息!M114=\"错误\",\"\",IF(填写信息!A114&填写信息!B114=\"\",\"\",填写信息!A114&\"/\"&填写信息!B114&\"/\"&填写信息!C114))","v":""}]
[{"$nulls":18},{"$f":"IF(填写信息!M115=\"错误\",\"\",IF(填写信息!A115&填写信息!B115=\"\",\"\",填写信息!A115&\"/\"&填写信息!B115&\"/\"&填写信息!C115))","v":""}]
[{"$nulls":18},{"$f":"IF(填写信息!M116=\"错误\",\"\",IF(填写信息!A116&填写信息!B116=\"\",\"\",填写信息!A116&\"/\"&填写信息!B116&\"/\"&填写信息!C116))","v":""}]
[{"$nulls":18},{"$f":"IF(填写信息!M117=\"错误\",\"\",IF(填写信息!A117&填写信息!B117=\"\",\"\",填写信息!A117&\"/\"&填写信息!B117&\"/\"&填写信息!C117))","v":""}]
[{"$nulls":18},{"$f":"IF(填写信息!M118=\"错误\",\"\",IF(填写信息!A118&填写信息!B118=\"\",\"\",填写信息!A118&\"/\"&填写信息!B118&\"/\"&填写信息!C118))","v":""}]
[{"$nulls":18},{"$f":"IF(填写信息!M119=\"错误\",\"\",IF(填写信息!A119&填写信息!B119=\"\",\"\",填写信息!A119&\"/\"&填写信息!B119&\"/\"&填写信息!C119))","v":""}]
[{"$nulls":18},{"$f":"IF(填写信息!M120=\"错误\",\"\",IF(填写信息!A120&填写信息!B120=\"\",\"\",填写信息!A120&\"/\"&填写信息!B120&\"/\"&填写信息!C120))","v":""}]
[{"$nulls":18},{"$f":"IF(填写信息!M121=\"错误\",\"\",IF(填写信息!A121&填写信息!B121=\"\",\"\",填写信息!A121&\"/\"&填写信息!B121&\"/\"&填写信息!C121))","v":""}]
[{"$nulls":18},{"$f":"IF(填写信息!M122=\"错误\",\"\",IF(填写信息!A122&填写信息!B122=\"\",\"\",填写信息!A122&\"/\"&填写信息!B122&\"/\"&填写信息!C122))","v":""}]
[{"$nulls":18},{"$f":"IF(填写信息!M123=\"错误\",\"\",IF(填写信息!A123&填写信息!B123=\"\",\"\",填写信息!A123&\"/\"&填写信息!B123&\"/\"&填写信息!C123))","v":""}]
[{"$nulls":18},{"$f":"IF(填写信息!M124=\"错误\",\"\",IF(填写信息!A124&填写信息!B124=\"\",\"\",填写信息!A124&\"/\"&填写信息!B124&\"/\"&填写信息!C124))","v":""}]
[{"$nulls":18},{"$f":"IF(填写信息!M125=\"错误\",\"\",IF(填写信息!A125&填写信息!B125=\"\",\"\",填写信息!A125&\"/\"&填写信息!B125&\"/\"&填写信息!C125))","v":""}]
[{"$nulls":18},{"$f":"IF(填写信息!M126=\"错误\",\"\",IF(填写信息!A126&填写信息!B126=\"\",\"\",填写信息!A126&\"/\"&填写信息!B126&\"/\"&填写信息!C126))","v":""}]
[{"$nulls":18},{"$f":"IF(填写信息!M127=\"错误\",\"\",IF(填写信息!A127&填写信息!B127=\"\",\"\",填写信息!A127&\"/\"&填写信息!B127&\"/\"&填写信息!C127))","v":""}]
[{"$nulls":18},{"$f":"IF(填写信息!M128=\"错误\",\"\",IF(填写信息!A128&填写信息!B128=\"\",\"\",填写信息!A128&\"/\"&填写信息!B128&\"/\"&填写信息!C128))","v":""}]
[{"$nulls":18},{"$f":"IF(填写信息!M129=\"错误\",\"\",IF(填写信息!A129&填写信息!B129=\"\",\"\",填写信息!A129&\"/\"&填写信息!B129&\"/\"&填写信息!C129))","v":""}]
[{"$nulls":18},{"$f":"IF(填写信息!M130=\"错误\",\"\",IF(填写信息!A130&填写信息!B130=\"\",\"\",填写信息!A130&\"/\"&填写信息!B130&\"/\"&填写信息!C130))","v":""}]
[{"$nulls":18},{"$f":"IF(填写信息!M131=\"错误\",\"\",IF(填写信息!A131&填写信息!B131=\"\",\"\",填写信息!A131&\"/\"&填写信息!B131&\"/\"&填写信息!C131))","v":""}]
[{"$nulls":18},{"$f":"IF(填写信息!M132=\"错误\",\"\",IF(填写信息!A132&填写信息!B132=\"\",\"\",填写信息!A132&\"/\"&填写信息!B132&\"/\"&填写信息!C132))","v":""}]
[{"$nulls":18},{"$f":"IF(填写信息!M133=\"错误\",\"\",IF(填写信息!A133&填写信息!B133=\"\",\"\",填写信息!A133&\"/\"&填写信息!B133&\"/\"&填写信息!C133))","v":""}]
[{"$nulls":18},{"$f":"IF(填写信息!M134=\"错误\",\"\",IF(填写信息!A134&填写信息!B134=\"\",\"\",填写信息!A134&\"/\"&填写信息!B134&\"/\"&填写信息!C134))","v":""}]
[{"$nulls":18},{"$f":"IF(填写信息!M135=\"错误\",\"\",IF(填写信息!A135&填写信息!B135=\"\",\"\",填写信息!A135&\"/\"&填写信息!B135&\"/\"&填写信息!C135))","v":""}]
[{"$nulls":18},{"$f":"IF(填写信息!M136=\"错误\",\"\",IF(填写信息!A136&填写信息!B136=\"\",\"\",填写信息!A136&\"/\"&填写信息!B136&\"/\"&填写信息!C136))","v":""}]
[{"$nulls":18},{"$f":"IF(填写信息!M137=\"错误\",\"\",IF(填写信息!A137&填写信息!B137=\"\",\"\",填写信息!A137&\"/\"&填写信息!B137&\"/\"&填写信息!C137))","v":""}]
[{"$nulls":18},{"$f":"IF(填写信息!M138=\"错误\",\"\",IF(填写信息!A138&填写信息!B138=\"\",\"\",填写信息!A138&\"/\"&填写信息!B138&\"/\"&填写信息!C138))","v":""}]
[{"$nulls":18},{"$f":"IF(填写信息!M139=\"错误\",\"\",IF(填写信息!A139&填写信息!B139=\"\",\"\",填写信息!A139&\"/\"&填写信息!B139&\"/\"&填写信息!C139))","v":""}]
[{"$nulls":18},{"$f":"IF(填写信息!M140=\"错误\",\"\",IF(填写信息!A140&填写信息!B140=\"\",\"\",填写信息!A140&\"/\"&填写信息!B140&\"/\"&填写信息!C140))","v":""}]
[{"$nulls":18},{"$f":"IF(填写信息!M141=\"错误\",\"\",IF(填写信息!A141&填写信息!B141=\"\",\"\",填写信息!A141&\"/\"&填写信息!B141&\"/\"&填写信息!C141))","v":""}]
[{"$nulls":18},{"$f":"IF(填写信息!M142=\"错误\",\"\",IF(填写信息!A142&填写信息!B142=\"\",\"\",填写信息!A142&\"/\"&填写信息!B142&\"/\"&填写信息!C142))","v":""}]
[{"$nulls":18},{"$f":"IF(填写信息!M143=\"错误\",\"\",IF(填写信息!A143&填写信息!B143=\"\",\"\",填写信息!A143&\"/\"&填写信息!B143&\"/\"&填写信息!C143))","v":""}]

{"sheet":"托运单B","index":2,"n_rows":70,"n_cols":25,"rows_kept":70,"cut":false,"hidden":false,"merged":[[1,5,1,6],[17,3,17,4],[22,0,23,0],[38,3,40,5],[22,1,23,3],[24,1,25,3],[22,4,35,5],[24,0,25,0]]}
[]
[]
[{"$f":"填写信息!B6","v":"BBBB有限公司"},null,null,null,"霞山联检",{"$f":"填写信息!B3","v":"156000888887"},{"$nulls":4},"霞山联检"]
[{"$f":"\"          \"&填写信息!B7&\"\"","v":"          91440XXXXXXXXXXXXX"},{"$nulls":9},"霞海联检"]
[{"$nulls":10},"国内转关"]
[]
[{"$f":"填写信息!B14&\" (\"&填写信息!B15&\")\"","v":"BBC CO.LTD (80808XXXXXXX)"}]
[]
[]
[]
[]
[{"$nulls":23},"海隆 318","5730550036"]
[{"$nulls":23},"海隆 9 号","5730550032"]
[{"$nulls":23},"海隆 228","5730550039"]
[{"$nulls":23},"海隆 628","5730550046"]
[{"$nulls":23},"建功188",{"$f":"5200500408&\"\"","v":"5200500408"}]
[{"$f":"托运单A!A17","v":"UNI-ACCORD V.0274519B 湛江"},{"$nulls":5}," ",{"$nulls":16},"中威",{"$f":"6705550000&\"\"","v":"6705550000"}]
[{"$f":"填写信息!B23&\", \"&填写信息!B22","v":"ABCPORT, JAPAN"},{"$nulls":22},"南鸿 933",{"$f":"6711550041&\"\"","v":"6711550041"}]
[{"$nulls":4},"      ",{"$nulls":18},"辰达",{"$f":"6401550009&\"\"","v":"6401550009"}]
[{"$nulls":23},"TAI HENG 6",{"$f":"6711550030&\"\"","v":"6711550030"}]
[{"$nulls":4},"  SHIPPER`S LOAD & COUNT & SEALED",{"$nulls":18},"HUI WAN 303",{"$f":"5338550065&\"\"","v":"5338550065"}]
[{"$nulls":4},{"$f":"托运单A!E22","v":"   1X40GP  1X40HQ   FCL  S.T.C CY-CY"},null,null,null,{"$f":"I23<=12","v":true},{"$nulls":9},{"$f":"填写信息!O96","v":1},{"$nulls":4},"YUE HAI 1001",{"$f":"6711550012&\"\"","v":"6711550012"}]
[{"$f":"托运单A!A23","v":"   1X40GP  1X40HQ   FCL"},{"$f":"\"P'kgs(TOTAL): \"&填写信息!J23&填写信息!D26","v":"P'kgs(TOTAL): 1000CTNS"},null,null,{"$f":"TRIM(SUBSTITUTE(SUBSTITUTE(SUBSTITUTE(SUBSTITUTE(填写信息!J22,CHAR(10),\" \"),CHAR(9),\" \"),\"[|]\",CHAR(10)),\"[,]\",\" \"))","v":"测试货名1 (100 CTNS 18000KGS)\n测试货名2 (100 PACKAGES 1200KGS)\n测试货名3 (100 REEL 1200KGS)\n测试货名4 (100 BAGS 1200KGS)\n测试货名5 (100 BRAID 1200KGS)\n测试货名6 (100 BAGS 1200KGS)\n测试货名7 (100 BAGS 1200KGS)\n测试货名8 (100 BAGS 1200KGS)\n测试货名9 (100 BAGS 1200KGS)\n测试货名10 (100 BAGS 1200KGS)\n"},null,null,null,{"$f":"VALUE(填写信息!B90)","v":0},{"$nulls":14},"Chang Yuan 9",{"$f":"6711550044&\"\"","v":"6711550044"}]
[{"$nulls":8},{"$f":"填写信息!B9","v":"1380975XXXX"},{"$f":"IF(填写信息!B8=\"\",\"\",填写信息!B8)","v":"广东省湛江市xxx区xxx街道888号"},{"$f":"IF(J24<>\"\",1,0)","v":1},{"$f":"IF(K24=0,\"\",SUM(K$24:K24))","v":1},{"$f":"填写信息!B16","v":"COUNTRY.STATE.CITY.DISTRICT.001"},1,null,null,{"$f":"填写信息!AI7","v":0},{"$f":"Q24","v":0},{"$f":"IF(填写信息!M97=\"错误\",\"\",IF(填写信息!A97&填写信息!B97=\"\",\"\",填写信息!A97&\"/\"&填写信息!B97&\"/\"&填写信息!C97))","v":"ABCD1234560/EMCABC0001/40HQ"},{"$nulls":4},"JIN LONG HAI",{"$f":"6711550020&\"\"","v":"6711550020"}]
[{"$f":"托运单A!A25","v":" 拖装"},{"$f":"\"G.W(TOTAL): \"&填写信息!J24&\"KGS\"","v":"G.W(TOTAL): 28800KGS"},{"$nulls":6},{"$f":"填写信息!B32","v":"测试货名7"},{"$f":"IF(填写信息!B31=\"\",\"\",填写信息!B31)","v":"测试货名6"},1,{"$f":"IF(K25=0,\"\",SUM(K$24:K25))","v":2},{"$f":"填写信息!B17","v":"886-886-886"},2,null,null,{"$f":"填写信息!AI11","v":0},{"$f":"IF(Q25=\"\",R24,Q25)","v":0},{"$f":"IF(填写信息!M98=\"错误\",\"\",IF(填写信息!A98&填写信息!B98=\"\",\"\",填写信息!A98&\"/\"&填写信息!B98&\"/\"&填写信息!C98))","v":""},{"$nulls":4},"南航927",{"$f":"6711550040&\"\"","v":"6711550040"}]
[{"$nulls":8},{"$f":"填写信息!B14","v":"BBC CO.LTD"},{"$f":"IF(填写信息!#REF!=\"\",\"\",填写信息!#REF!)","v":{"$error":"#REF!"}},{"$error":"#REF!"},{"$f":"IF(K26=0,\"\",SUM(K$24:K26))","v":{"$error":"#REF!"}},{"$f":"填写信息!B18","v":"SOMEBODY"},3,null,null,{"$f":"填写信息!AI15","v":0},{"$f":"IF(Q26=\"\",R25,Q26)","v":0},{"$f":"IF(填写信息!M99=\"错误\",\"\",IF(填写信息!A99&填写信息!B99=\"\",\"\",填写信息!A99&\"/\"&填写信息!B99&\"/\"&填写信息!C99))","v":""},{"$nulls":4},"ZHENG HUA 393",{"$f":"5338550092&\"\"","v":"5338550092"}]
[{"$f":"S24","v":"ABCD1234560/EMCABC0001/40HQ"},{"$nulls":7},{"$f":"填写信息!B17","v":"886-886-886"},{"$f":"IF(填写信息!B16=\"\",\"\",填写信息!B16)","v":"COUNTRY.STATE.CITY.DISTRICT.001"},1,{"$f":"IF(K27=0,\"\",SUM(K$24:K27))","v":{"$error":"#REF!"}},{"$f":"填写信息!#REF!","v":{"$error":"#REF!"}},4,"20GP",{"$f":"IF(INDIRECT(\"填写信息!B\"&MATCH(O27,填写信息!A$1:A$94,0))=\"\",\"\",INDIRECT(\"填写信息!B\"&MATCH(O27,填写信息!A$1:A$94,0))&\"X\"&O27&\"  \")","v":""},{"$f":"填写信息!AI19","v":0},0,{"$f":"IF(填写信息!M100=\"错误\",\"\",IF(填写信息!A100&填写信息!B100=\"\",\"\",填写信息!A100&\"/\"&填写信息!B100&\"/\"&填写信息!C100))","v":""},{"$nulls":4},"SHENG HE",{"$f":"9058402&\"\"","v":"9058402"}]
[{"$f":"S25","v":""},{"$nulls":7},{"$f":"填写信息!#REF!","v":{"$error":"#REF!"}},{"$f":"IF(填写信息!B18=\"\",\"\",填写信息!B18)","v":"SOMEBODY"},1,{"$f":"IF(K28=0,\"\",SUM(K$24:K28))","v":{"$error":"#REF!"}},{"$f":"填写信息!B19","v":0},5,"40GP",{"$f":"IF(INDIRECT(\"填写信息!B\"&MATCH(O28,填写信息!A$1:A$94,0))=\"\",\"\",INDIRECT(\"填写信息!B\"&MATCH(O28,填写信息!A$1:A$94,0))&\"X\"&O28&\"  \")","v":"1X40GP  "},{"$f":"填写信息!AI23","v":0},0,{"$f":"IF(填写信息!M101=\"错误\",\"\",IF(填写信息!A101&填写信息!B101=\"\",\"\",填写信息!A101&\"/\"&填写信息!B101&\"/\"&填写信息!C101))","v":""},{"$nulls":4},"YAN HE",{"$f":"9118111&\"\"","v":"9118111"}]
["",{"$nulls":7},{"$f":"填写信息!#REF!","v":{"$error":"#REF!"}},{"$f":"IF(填写信息!#REF!=\"\",\"\",填写信息!#REF!)","v":{"$error":"#REF!"}},{"$error":"#REF!"},{"$f":"IF(K29=0,\"\",SUM(K$24:K29))","v":{"$error":"#REF!"}},{"$f":"填写信息!#REF!","v":{"$error":"#REF!"}},6,"40HQ",{"$f":"IF(INDIRECT(\"填写信息!B\"&MATCH(O29,填写信息!A$1:A$94,0))=\"\",\"\",INDIRECT(\"填写信息!B\"&MATCH(O29,填写信息!A$1:A$94,0))&\"X\"&O29&\"  \")","v":"1X40HQ  "},{"$f":"填写信息!AI27","v":0},0,{"$f":"IF(填写信息!M102=\"错误\",\"\",IF(填写信息!A102&填写信息!B102=\"\",\"\",填写信息!A102&\"/\"&填写信息!B102&\"/\"&填写信息!C102))","v":""},{"$nulls":4},"PING YE 2",{"$f":"6020550019&\"\"","v":"6020550019"}]
["",{"$nulls":7},{"$f":"填写信息!#REF!","v":{"$error":"#REF!"}},{"$f":"IF(填写信息!#REF!=\"\",\"\",填写信息!#REF!)","v":{"$error":"#REF!"}},{"$error":"#REF!"},{"$f":"IF(K30=0,\"\",SUM(K$24:K30))","v":{"$error":"#REF!"}},{"$f":"填写信息!#REF!","v":{"$error":"#REF!"}},7,"20RF",{"$f":"IF(INDIRECT(\"填写信息!B\"&MATCH(O30,填写信息!A$1:A$94,0))=\"\",\"\",INDIRECT(\"填写信息!B\"&MATCH(O30,填写信息!A$1:A$94,0))&\"X\"&O30&\"  \")","v":""},{"$f":"填写信息!AI31","v":0},0,{"$f":"IF(填写信息!M103=\"错误\",\"\",IF(填写信息!A103&填写信息!B103=\"\",\"\",填写信息!A103&\"/\"&填写信息!B103&\"/\"&填写信息!C103))","v":""}]
["",{"$nulls":7},{"$f":"填写信息!#REF!","v":{"$error":"#REF!"}},{"$f":"IF(填写信息!#REF!=\"\",\"\",填写信息!#REF!)","v":{"$error":"#REF!"}},{"$error":"#REF!"},{"$f":"IF(K31=0,\"\",SUM(K$24:K31))","v":{"$error":"#REF!"}},{"$f":"填写信息!B37","v":0},8,{"$f":"填写信息!A94","v":"40RH"},{"$f":"IF(INDIRECT(\"填写信息!B\"&MATCH(O31,填写信息!A$1:A$94,0))=\"\",\"\",INDIRECT(\"填写信息!B\"&MATCH(O31,填写信息!A$1:A$94,0))&\"X\"&O31&\"  \")","v":""},{"$f":"填写信息!AI35","v":0},0,{"$f":"IF(填写信息!M104=\"错误\",\"\",IF(填写信息!A104&填写信息!B104=\"\",\"\",填写信息!A104&\"/\"&填写信息!B104&\"/\"&填写信息!C104))","v":""}]
["",{"$nulls":7},{"$f":"填写信息!#REF!","v":{"$error":"#REF!"}},{"$f":"IF(填写信息!#REF!=\"\",\"\",填写信息!#REF!)","v":{"$error":"#REF!"}},{"$error":"#REF!"},{"$f":"IF(K32=0,\"\",SUM(K$24:K32))","v":{"$error":"#REF!"}},{"$f":"填写信息!B87","v":0},9,null,null,{"$f":"填写信息!AI39","v":0},0,{"$f":"IF(填写信息!M105=\"错误\",\"\",IF(填写信息!A105&填写信息!B105=\"\",\"\",填写信息!A105&\"/\"&填写信息!B105&\"/\"&填写信息!C105))","v":""}]
["",{"$nulls":12},10,{"$nulls":4},{"$f":"IF(填写信息!M106=\"错误\",\"\",IF(填写信息!A106&填写信息!B106=\"\",\"\",填写信息!A106&\"/\"&填写信息!B106&\"/\"&填写信息!C106))","v":""}]
["",{"$nulls":12},11,null,null,null,{"$f":"IF(AND(R24=R25,R26=R27,R28=R29,R30=R31,R32=R24,R25=R26,R27=R28,R29=R30,R31=R32),R32,\"CTNS\")","v":0},{"$f":"IF(填写信息!M107=\"错误\",\"\",IF(填写信息!A107&填写信息!B107=\"\",\"\",填写信息!A107&\"/\"&填写信息!B107&\"/\"&填写信息!C107))","v":""}]
["",{"$nulls":17},{"$f":"IF(填写信息!M108=\"错误\",\"\",IF(填写信息!A108&填写信息!B108=\"\",\"\",填写信息!A108&\"/\"&填写信息!B108&\"/\"&填写信息!C108))","v":""}]
["",{"$nulls":17},{"$f":"IF(填写信息!M109=\"错误\",\"\",IF(填写信息!A109&填写信息!B109=\"\",\"\",填写信息!A109&\"/\"&填写信息!B109&\"/\"&填写信息!C109))","v":""}]
[{"$nulls":18},{"$f":"IF(填写信息!M110=\"错误\",\"\",IF(填写信息!A110&填写信息!B110=\"\",\"\",填写信息!A110&\"/\"&填写信息!B110&\"/\"&填写信息!C110))","v":""}]
[{"$nulls":18},{"$f":"IF(填写信息!M111=\"错误\",\"\",IF(填写信息!A111&填写信息!B111=\"\",\"\",填写信息!A111&\"/\"&填写信息!B111&\"/\"&填写信息!C111))","v":""}]
[null,null,null,{"$f":"\"TOTAL:  \"&填写信息!AT55&填写信息!AT56&\" ONLY\"","v":"TOTAL:  TWO FORTY FEET CONTAINER(1X40GP+1X40HQ) ONLY"},{"$nulls":14},{"$f":"IF(填写信息!M112=\"错误\",\"\",IF(填写信息!A112&填写信息!B112=\"\",\"\",填写信息!A112&\"/\"&填写信息!B112&\"/\"&填写信息!C112))","v":""}]
[{"$nulls":18},{"$f":"IF(填写信息!M113=\"错误\",\"\",IF(填写信息!A113&填写信息!B113=\"\",\"\",填写信息!A113&\"/\"&填写信息!B113&\"/\"&填写信息!C113))","v":""}]
[{"$nulls":18},{"$f":"IF(填写信息!M114=\"错误\",\"\",IF(填写信息!A114&填写信息!B114=\"\",\"\",填写信息!A114&\"/\"&填写信息!B114&\"/\"&填写信息!C114))","v":""}]
[{"$nulls":18},{"$f":"IF(填写信息!M115=\"错误\",\"\",IF(填写信息!A115&填写信息!B115=\"\",\"\",填写信息!A115&\"/\"&填写信息!B115&\"/\"&填写信息!C115))","v":""}]
[{"$nulls":18},{"$f":"IF(填写信息!M116=\"错误\",\"\",IF(填写信息!A116&填写信息!B116=\"\",\"\",填写信息!A116&\"/\"&填写信息!B116&\"/\"&填写信息!C116))","v":""}]
[{"$nulls":18},{"$f":"IF(填写信息!M117=\"错误\",\"\",IF(填写信息!A117&填写信息!B117=\"\",\"\",填写信息!A117&\"/\"&填写信息!B117&\"/\"&填写信息!C117))","v":""}]
[{"$nulls":9},"总和：",{"$f":"SUM(K24:K33)","v":{"$error":"#REF!"}},{"$nulls":7},{"$f":"IF(填写信息!M118=\"错误\",\"\",IF(填写信息!A118&填写信息!B118=\"\",\"\",填写信息!A118&\"/\"&填写信息!B118&\"/\"&填写信息!C118))","v":""}]
[{"$nulls":18},{"$f":"IF(填写信息!M119=\"错误\",\"\",IF(填写信息!A119&填写信息!B119=\"\",\"\",填写信息!A119&\"/\"&填写信息!B119&\"/\"&填写信息!C119))","v":""}]
[{"$nulls":18},{"$f":"IF(填写信息!M120=\"错误\",\"\",IF(填写信息!A120&填写信息!B120=\"\",\"\",填写信息!A120&\"/\"&填写信息!B120&\"/\"&填写信息!C120))","v":""}]
[{"$nulls":18},{"$f":"IF(填写信息!M121=\"错误\",\"\",IF(填写信息!A121&填写信息!B121=\"\",\"\",填写信息!A121&\"/\"&填写信息!B121&\"/\"&填写信息!C121))","v":""}]
[{"$nulls":18},{"$f":"IF(填写信息!M122=\"错误\",\"\",IF(填写信息!A122&填写信息!B122=\"\",\"\",填写信息!A122&\"/\"&填写信息!B122&\"/\"&填写信息!C122))","v":""}]
[{"$nulls":18},{"$f":"IF(填写信息!M123=\"错误\",\"\",IF(填写信息!A123&填写信息!B123=\"\",\"\",填写信息!A123&\"/\"&填写信息!B123&\"/\"&填写信息!C123))","v":""}]
[{"$nulls":18},{"$f":"IF(填写信息!M124=\"错误\",\"\",IF(填写信息!A124&填写信息!B124=\"\",\"\",填写信息!A124&\"/\"&填写信息!B124&\"/\"&填写信息!C124))","v":""}]
[{"$nulls":18},{"$f":"IF(填写信息!M125=\"错误\",\"\",IF(填写信息!A125&填写信息!B125=\"\",\"\",填写信息!A125&\"/\"&填写信息!B125&\"/\"&填写信息!C125))","v":""}]
[{"$nulls":18},{"$f":"IF(填写信息!M126=\"错误\",\"\",IF(填写信息!A126&填写信息!B126=\"\",\"\",填写信息!A126&\"/\"&填写信息!B126&\"/\"&填写信息!C126))","v":""}]
[{"$nulls":18},{"$f":"IF(填写信息!M127=\"错误\",\"\",IF(填写信息!A127&填写信息!B127=\"\",\"\",填写信息!A127&\"/\"&填写信息!B127&\"/\"&填写信息!C127))","v":""}]
[{"$nulls":18},{"$f":"IF(填写信息!M128=\"错误\",\"\",IF(填写信息!A128&填写信息!B128=\"\",\"\",填写信息!A128&\"/\"&填写信息!B128&\"/\"&填写信息!C128))","v":""}]
[{"$nulls":18},{"$f":"IF(填写信息!M129=\"错误\",\"\",IF(填写信息!A129&填写信息!B129=\"\",\"\",填写信息!A129&\"/\"&填写信息!B129&\"/\"&填写信息!C129))","v":""}]
[{"$nulls":18},{"$f":"IF(填写信息!M130=\"错误\",\"\",IF(填写信息!A130&填写信息!B130=\"\",\"\",填写信息!A130&\"/\"&填写信息!B130&\"/\"&填写信息!C130))","v":""}]
[{"$nulls":18},{"$f":"IF(填写信息!M131=\"错误\",\"\",IF(填写信息!A131&填写信息!B131=\"\",\"\",填写信息!A131&\"/\"&填写信息!B131&\"/\"&填写信息!C131))","v":""}]
[{"$nulls":18},{"$f":"IF(填写信息!M132=\"错误\",\"\",IF(填写信息!A132&填写信息!B132=\"\",\"\",填写信息!A132&\"/\"&填写信息!B132&\"/\"&填写信息!C132))","v":""}]
[{"$nulls":18},{"$f":"IF(填写信息!M133=\"错误\",\"\",IF(填写信息!A133&填写信息!B133=\"\",\"\",填写信息!A133&\"/\"&填写信息!B133&\"/\"&填写信息!C133))","v":""}]
[{"$nulls":18},{"$f":"IF(填写信息!M134=\"错误\",\"\",IF(填写信息!A134&填写信息!B134=\"\",\"\",填写信息!A134&\"/\"&填写信息!B134&\"/\"&填写信息!C134))","v":""}]
[{"$nulls":18},{"$f":"IF(填写信息!M135=\"错误\",\"\",IF(填写信息!A135&填写信息!B135=\"\",\"\",填写信息!A135&\"/\"&填写信息!B135&\"/\"&填写信息!C135))","v":""}]
[{"$nulls":18},{"$f":"IF(填写信息!M136=\"错误\",\"\",IF(填写信息!A136&填写信息!B136=\"\",\"\",填写信息!A136&\"/\"&填写信息!B136&\"/\"&填写信息!C136))","v":""}]
[{"$nulls":18},{"$f":"IF(填写信息!M137=\"错误\",\"\",IF(填写信息!A137&填写信息!B137=\"\",\"\",填写信息!A137&\"/\"&填写信息!B137&\"/\"&填写信息!C137))","v":""}]
[{"$nulls":18},{"$f":"IF(填写信息!M138=\"错误\",\"\",IF(填写信息!A138&填写信息!B138=\"\",\"\",填写信息!A138&\"/\"&填写信息!B138&\"/\"&填写信息!C138))","v":""}]
[{"$nulls":18},{"$f":"IF(填写信息!M139=\"错误\",\"\",IF(填写信息!A139&填写信息!B139=\"\",\"\",填写信息!A139&\"/\"&填写信息!B139&\"/\"&填写信息!C139))","v":""}]
[{"$nulls":18},{"$f":"IF(填写信息!M140=\"错误\",\"\",IF(填写信息!A140&填写信息!B140=\"\",\"\",填写信息!A140&\"/\"&填写信息!B140&\"/\"&填写信息!C140))","v":""}]
[{"$nulls":18},{"$f":"IF(填写信息!M141=\"错误\",\"\",IF(填写信息!A141&填写信息!B141=\"\",\"\",填写信息!A141&\"/\"&填写信息!B141&\"/\"&填写信息!C141))","v":""}]
[{"$nulls":18},{"$f":"IF(填写信息!M142=\"错误\",\"\",IF(填写信息!A142&填写信息!B142=\"\",\"\",填写信息!A142&\"/\"&填写信息!B142&\"/\"&填写信息!C142))","v":""}]
[{"$nulls":18},{"$f":"IF(填写信息!M143=\"错误\",\"\",IF(填写信息!A143&填写信息!B143=\"\",\"\",填写信息!A143&\"/\"&填写信息!B143&\"/\"&填写信息!C143))","v":""}]

{"sheet":"托运单C","index":3,"n_rows":143,"n_cols":25,"rows_kept":143,"cut":false,"hidden":false,"merged":[[1,5,1,6],[17,3,17,4],[22,0,23,0],[38,3,40,5],[28,0,34,2],[22,1,23,3],[24,1,25,3],[22,4,35,5],[24,0,25,0]]}
[]
[]
[{"$f":"填写信息!B6","v":"BBBB有限公司"},null,null,null,"霞山联检",{"$f":"填写信息!B3","v":"156000888887"},{"$nulls":4},"霞山联检"]
[{"$f":"\"          \"&填写信息!B7&\"\"","v":"          91440XXXXXXXXXXXXX"},{"$nulls":9},"霞海联检"]
[{"$nulls":10},"国内转关"]
[]
[{"$f":"填写信息!B14&\" (\"&填写信息!B15&\")\"","v":"BBC CO.LTD (80808XXXXXXX)"}]
[]
[]
[]
[]
[{"$nulls":23},"海隆 318","5730550036"]
[{"$nulls":23},"海隆 9 号","5730550032"]
[{"$nulls":23},"海隆 228","5730550039"]
[{"$nulls":23},"海隆 628","5730550046"]
[{"$nulls":23},"建功188",{"$f":"5200500408&\"\"","v":"5200500408"}]
[{"$f":"托运单A!A17","v":"UNI-ACCORD V.0274519B 湛江"},{"$nulls":5}," ",{"$nulls":16},"中威",{"$f":"6705550000&\"\"","v":"6705550000"}]
[{"$f":"填写信息!B23&\", \"&填写信息!B22","v":"ABCPORT, JAPAN"},{"$nulls":22},"南鸿 933",{"$f":"6711550041&\"\"","v":"6711550041"}]
[{"$nulls":4},"      ",{"$nulls":18},"辰达",{"$f":"6401550009&\"\"","v":"6401550009"}]
[{"$nulls":23},"TAI HENG 6",{"$f":"6711550030&\"\"","v":"6711550030"}]
[{"$nulls":4},"  SHIPPER`S LOAD & COUNT & SEALED",{"$nulls":18},"HUI WAN 303",{"$f":"5338550065&\"\"","v":"5338550065"}]
[{"$nulls":4},{"$f":"托运单A!E22","v":"   1X40GP  1X40HQ   FCL  S.T.C CY-CY"},null,null,null,{"$f":"I23<=12","v":true},{"$nulls":9},{"$f":"填写信息!O96","v":1},{"$nulls":4},"YUE HAI 1001",{"$f":"6711550012&\"\"","v":"6711550012"}]
[{"$f":"托运单A!A23","v":"   1X40GP  1X40HQ   FCL"},{"$f":"托运单B!B23","v":"P'kgs(TOTAL): 1000CTNS"},null,null,{"$f":"TRIM(SUBSTITUTE(SUBSTITUTE(SUBSTITUTE(SUBSTITUTE(填写信息!J22,CHAR(10),\" \"),CHAR(9),\" \"),\"[|]\",CHAR(10)),\"[,]\",\" \"))","v":"测试货名1 (100 CTNS 18000KGS)\n测试货名2 (100 PACKAGES 1200KGS)\n测试货名3 (100 REEL 1200KGS)\n测试货名4 (100 BAGS 1200KGS)\n测试货名5 (100 BRAID 1200KGS)\n测试货名6 (100 BAGS 1200KGS)\n测试货名7 (100 BAGS 1200KGS)\n测试货名8 (100 BAGS 1200KGS)\n测试货名9 (100 BAGS 1200KGS)\n测试货名10 (100 BAGS 1200KGS)\n"},null,null,null,{"$f":"VALUE(填写信息!B90)","v":0},{"$nulls":14},"Chang Yuan 9",{"$f":"6711550044&\"\"","v":"6711550044"}]
[{"$nulls":8},{"$f":"填写信息!B9","v":"1380975XXXX"},{"$f":"IF(填写信息!B8=\"\",\"\",填写信息!B8)","v":"广东省湛江市xxx区xxx街道888号"},{"$f":"IF(J24<>\"\",1,0)","v":1},{"$f":"IF(K24=0,\"\",SUM(K$24:K24))","v":1},{"$f":"填写信息!B16","v":"COUNTRY.STATE.CITY.DISTRICT.001"},1,null,null,{"$f":"填写信息!AI7","v":0},{"$f":"Q24","v":0},{"$f":"IF(填写信息!M97=\"错误\",\"\",IF(填写信息!A97&填写信息!B97=\"\",\"\",填写信息!A97&\"/\"&填写信息!B97&\"/\"&填写信息!C97))","v":"ABCD1234560/EMCABC0001/40HQ"},{"$nulls":4},"JIN LONG HAI",{"$f":"6711550020&\"\"","v":"6711550020"}]
[{"$f":"托运单A!A25","v":" 拖装"},{"$f":"托运单B!B25","v":"G.W(TOTAL): 28800KGS"},{"$nulls":6},{"$f":"填写信息!B32","v":"测试货名7"},{"$f":"IF(填写信息!B31=\"\",\"\",填写信息!B31)","v":"测试货名6"},1,{"$f":"IF(K25=0,\"\",SUM(K$24:K25))","v":2},{"$f":"填写信息!B17","v":"886-886-886"},2,null,null,{"$f":"填写信息!AI11","v":0},{"$f":"IF(Q25=\"\",R24,Q25)","v":0},{"$f":"IF(填写信息!M98=\"错误\",\"\",IF(填写信息!A98&填写信息!B98=\"\",\"\",填写信息!A98&\"/\"&填写信息!B98&\"/\"&填写信息!C98))","v":""},{"$nulls":4},"南航927",{"$f":"6711550040&\"\"","v":"6711550040"}]
[{"$nulls":8},{"$f":"填写信息!B14","v":"BBC CO.LTD"},{"$f":"IF(填写信息!#REF!=\"\",\"\",填写信息!#REF!)","v":{"$error":"#REF!"}},{"$error":"#REF!"},{"$f":"IF(K26=0,\"\",SUM(K$24:K26))","v":{"$error":"#REF!"}},{"$f":"填写信息!B18","v":"SOMEBODY"},3,null,null,{"$f":"填写信息!AI15","v":0},{"$f":"IF(Q26=\"\",R25,Q26)","v":0},{"$f":"IF(填写信息!M99=\"错误\",\"\",IF(填写信息!A99&填写信息!B99=\"\",\"\",填写信息!A99&\"/\"&填写信息!B99&\"/\"&填写信息!C99))","v":""},{"$nulls":4},"ZHENG HUA 393",{"$f":"5338550092&\"\"","v":"5338550092"}]
[{"$nulls":8},{"$f":"填写信息!B17","v":"886-886-886"},{"$f":"IF(填写信息!B16=\"\",\"\",填写信息!B16)","v":"COUNTRY.STATE.CITY.DISTRICT.001"},1,{"$f":"IF(K27=0,\"\",SUM(K$24:K27))","v":{"$error":"#REF!"}},{"$f":"填写信息!#REF!","v":{"$error":"#REF!"}},4,"20GP",{"$f":"IF(INDIRECT(\"填写信息!B\"&MATCH(O27,填写信息!A$1:A$94,0))=\"\",\"\",INDIRECT(\"填写信息!B\"&MATCH(O27,填写信息!A$1:A$94,0))&\"X\"&O27&\"  \")","v":""},{"$f":"填写信息!AI19","v":0},0,{"$f":"IF(填写信息!M100=\"错误\",\"\",IF(填写信息!A100&填写信息!B100=\"\",\"\",填写信息!A100&\"/\"&填写信息!B100&\"/\"&填写信息!C100))","v":""},{"$nulls":4},"SHENG HE",{"$f":"9058402&\"\"","v":"9058402"}]
[{"$nulls":8},{"$f":"填写信息!#REF!","v":{"$error":"#REF!"}},{"$f":"IF(填写信息!B18=\"\",\"\",填写信息!B18)","v":"SOMEBODY"},1,{"$f":"IF(K28=0,\"\",SUM(K$24:K28))","v":{"$error":"#REF!"}},{"$f":"填写信息!B19","v":0},5,"40GP",{"$f":"IF(INDIRECT(\"填写信息!B\"&MATCH(O28,填写信息!A$1:A$94,0))=\"\",\"\",INDIRECT(\"填写信息!B\"&MATCH(O28,填写信息!A$1:A$94,0))&\"X\"&O28&\"  \")","v":"1X40GP  "},{"$f":"填写信息!AI23","v":0},0,{"$f":"IF(填写信息!M101=\"错误\",\"\",IF(填写信息!A101&填写信息!B101=\"\",\"\",填写信息!A101&\"/\"&填写信息!B101&\"/\"&填写信息!C101))","v":""},{"$nulls":4},"YAN HE",{"$f":"9118111&\"\"","v":"9118111"}]
["集装箱号见附页",{"$nulls":7},{"$f":"填写信息!#REF!","v":{"$error":"#REF!"}},{"$f":"IF(填写信息!#REF!=\"\",\"\",填写信息!#REF!)","v":{"$error":"#REF!"}},{"$error":"#REF!"},{"$f":"IF(K29=0,\"\",SUM(K$24:K29))","v":{"$error":"#REF!"}},{"$f":"填写信息!#REF!","v":{"$error":"#REF!"}},6,"40HQ",{"$f":"IF(INDIRECT(\"填写信息!B\"&MATCH(O29,填写信息!A$1:A$94,0))=\"\",\"\",INDIRECT(\"填写信息!B\"&MATCH(O29,填写信息!A$1:A$94,0))&\"X\"&O29&\"  \")","v":"1X40HQ  "},{"$f":"填写信息!AI27","v":0},0,{"$f":"IF(填写信息!M102=\"错误\",\"\",IF(填写信息!A102&填写信息!B102=\"\",\"\",填写信息!A102&\"/\"&填写信息!B102&\"/\"&填写信息!C102))","v":""},{"$nulls":4},"PING YE 2",{"$f":"6020550019&\"\"","v":"6020550019"}]
[{"$nulls":8},{"$f":"填写信息!#REF!","v":{"$error":"#REF!"}},{"$f":"IF(填写信息!#REF!=\"\",\"\",填写信息!#REF!)","v":{"$error":"#REF!"}},{"$error":"#REF!"},{"$f":"IF(K30=0,\"\",SUM(K$24:K30))","v":{"$error":"#REF!"}},{"$f":"填写信息!#REF!","v":{"$error":"#REF!"}},7,"20RF",{"$f":"IF(INDIRECT(\"填写信息!B\"&MATCH(O30,填写信息!A$1:A$94,0))=\"\",\"\",INDIRECT(\"填写信息!B\"&MATCH(O30,填写信息!A$1:A$94,0))&\"X\"&O30&\"  \")","v":""},{"$f":"填写信息!AI31","v":0},0,{"$f":"IF(填写信息!M103=\"错误\",\"\",IF(填写信息!A103&填写信息!B103=\"\",\"\",填写信息!A103&\"/\"&填写信息!B103&\"/\"&填写信息!C103))","v":""}]
[{"$nulls":8},{"$f":"填写信息!#REF!","v":{"$error":"#REF!"}},{"$f":"IF(填写信息!#REF!=\"\",\"\",填写信息!#REF!)","v":{"$error":"#REF!"}},{"$error":"#REF!"},{"$f":"IF(K31=0,\"\",SUM(K$24:K31))","v":{"$error":"#REF!"}},{"$f":"填写信息!B37","v":0},8,{"$f":"填写信息!A94","v":"40RH"},{"$f":"IF(INDIRECT(\"填写信息!B\"&MATCH(O31,填写信息!A$1:A$94,0))=\"\",\"\",INDIRECT(\"填写信息!B\"&MATCH(O31,填写信息!A$1:A$94,0))&\"X\"&O31&\"  \")","v":""},{"$f":"填写信息!AI35","v":0},0,{"$f":"IF(填写信息!M104=\"错误\",\"\",IF(填写信息!A104&填写信息!B104=\"\",\"\",填写信息!A104&\"/\"&填写信息!B104&\"/\"&填写信息!C104))","v":""}]
[{"$nulls":8},{"$f":"填写信息!#REF!","v":{"$error":"#REF!"}},{"$f":"IF(填写信息!#REF!=\"\",\"\",填写信息!#REF!)","v":{"$error":"#REF!"}},{"$error":"#REF!"},{"$f":"IF(K32=0,\"\",SUM(K$24:K32))","v":{"$error":"#REF!"}},{"$f":"填写信息!B87","v":0},9,null,null,{"$f":"填写信息!AI39","v":0},0,{"$f":"IF(填写信息!M105=\"错误\",\"\",IF(填写信息!A105&填写信息!B105=\"\",\"\",填写信息!A105&\"/\"&填写信息!B105&\"/\"&填写信息!C105))","v":""}]
[{"$nulls":13},10,{"$nulls":4},{"$f":"IF(填写信息!M106=\"错误\",\"\",IF(填写信息!A106&填写信息!B106=\"\",\"\",填写信息!A106&\"/\"&填写信息!B106&\"/\"&填写信息!C106))","v":""}]
[{"$nulls":13},11,null,null,null,{"$f":"IF(AND(R24=R25,R26=R27,R28=R29,R30=R31,R32=R24,R25=R26,R27=R28,R29=R30,R31=R32),R32,\"CTNS\")","v":0},{"$f":"IF(填写信息!M107=\"错误\",\"\",IF(填写信息!A107&填写信息!B107=\"\",\"\",填写信息!A107&\"/\"&填写信息!B107&\"/\"&填写信息!C107))","v":""}]
[{"$nulls":18},{"$f":"IF(填写信息!M108=\"错误\",\"\",IF(填写信息!A108&填写信息!B108=\"\",\"\",填写信息!A108&\"/\"&填写信息!B108&\"/\"&填写信息!C108))","v":""}]
[{"$nulls":18},{"$f":"IF(填写信息!M109=\"错误\",\"\",IF(填写信息!A109&填写信息!B109=\"\",\"\",填写信息!A109&\"/\"&填写信息!B109&\"/\"&填写信息!C109))","v":""}]
[{"$nulls":18},{"$f":"IF(填写信息!M110=\"错误\",\"\",IF(填写信息!A110&填写信息!B110=\"\",\"\",填写信息!A110&\"/\"&填写信息!B110&\"/\"&填写信息!C110))","v":""}]
[{"$nulls":18},{"$f":"IF(填写信息!M111=\"错误\",\"\",IF(填写信息!A111&填写信息!B111=\"\",\"\",填写信息!A111&\"/\"&填写信息!B111&\"/\"&填写信息!C111))","v":""}]
[null,null,null,{"$f":"\"TOTAL:  \"&填写信息!AT55&填写信息!AT56&\" ONLY\"","v":"TOTAL:  TWO FORTY FEET CONTAINER(1X40GP+1X40HQ) ONLY"},{"$nulls":14},{"$f":"IF(填写信息!M112=\"错误\",\"\",IF(填写信息!A112&填写信息!B112=\"\",\"\",填写信息!A112&\"/\"&填写信息!B112&\"/\"&填写信息!C112))","v":""}]
[{"$nulls":18},{"$f":"IF(填写信息!M113=\"错误\",\"\",IF(填写信息!A113&填写信息!B113=\"\",\"\",填写信息!A113&\"/\"&填写信息!B113&\"/\"&填写信息!C113))","v":""}]
[{"$nulls":18},{"$f":"IF(填写信息!M114=\"错误\",\"\",IF(填写信息!A114&填写信息!B114=\"\",\"\",填写信息!A114&\"/\"&填写信息!B114&\"/\"&填写信息!C114))","v":""}]
[{"$nulls":18},{"$f":"IF(填写信息!M115=\"错误\",\"\",IF(填写信息!A115&填写信息!B115=\"\",\"\",填写信息!A115&\"/\"&填写信息!B115&\"/\"&填写信息!C115))","v":""}]
[{"$nulls":18},{"$f":"IF(填写信息!M116=\"错误\",\"\",IF(填写信息!A116&填写信息!B116=\"\",\"\",填写信息!A116&\"/\"&填写信息!B116&\"/\"&填写信息!C116))","v":""}]
[{"$nulls":18},{"$f":"IF(填写信息!M117=\"错误\",\"\",IF(填写信息!A117&填写信息!B117=\"\",\"\",填写信息!A117&\"/\"&填写信息!B117&\"/\"&填写信息!C117))","v":""}]
[{"$nulls":9},"总和：",{"$f":"SUM(K24:K33)","v":{"$error":"#REF!"}},{"$nulls":7},{"$f":"IF(填写信息!M118=\"错误\",\"\",IF(填写信息!A118&填写信息!B118=\"\",\"\",填写信息!A118&\"/\"&填写信息!B118&\"/\"&填写信息!C118))","v":""}]
[{"$nulls":18},{"$f":"IF(填写信息!M119=\"错误\",\"\",IF(填写信息!A119&填写信息!B119=\"\",\"\",填写信息!A119&\"/\"&填写信息!B119&\"/\"&填写信息!C119))","v":""}]
[{"$nulls":18},{"$f":"IF(填写信息!M120=\"错误\",\"\",IF(填写信息!A120&填写信息!B120=\"\",\"\",填写信息!A120&\"/\"&填写信息!B120&\"/\"&填写信息!C120))","v":""}]
[{"$nulls":18},{"$f":"IF(填写信息!M121=\"错误\",\"\",IF(填写信息!A121&填写信息!B121=\"\",\"\",填写信息!A121&\"/\"&填写信息!B121&\"/\"&填写信息!C121))","v":""}]
[{"$nulls":18},{"$f":"IF(填写信息!M122=\"错误\",\"\",IF(填写信息!A122&填写信息!B122=\"\",\"\",填写信息!A122&\"/\"&填写信息!B122&\"/\"&填写信息!C122))","v":""}]
[{"$nulls":18},{"$f":"IF(填写信息!M123=\"错误\",\"\",IF(填写信息!A123&填写信息!B123=\"\",\"\",填写信息!A123&\"/\"&填写信息!B123&\"/\"&填写信息!C123))","v":""}]
[{"$nulls":18},{"$f":"IF(填写信息!M124=\"错误\",\"\",IF(填写信息!A124&填写信息!B124=\"\",\"\",填写信息!A124&\"/\"&填写信息!B124&\"/\"&填写信息!C124))","v":""}]
[{"$nulls":18},{"$f":"IF(填写信息!M125=\"错误\",\"\",IF(填写信息!A125&填写信息!B125=\"\",\"\",填写信息!A125&\"/\"&填写信息!B125&\"/\"&填写信息!C125))","v":""}]
[{"$nulls":18},{"$f":"IF(填写信息!M126=\"错误\",\"\",IF(填写信息!A126&填写信息!B126=\"\",\"\",填写信息!A126&\"/\"&填写信息!B126&\"/\"&填写信息!C126))","v":""}]
[{"$nulls":18},{"$f":"IF(填写信息!M127=\"错误\",\"\",IF(填写信息!A127&填写信息!B127=\"\",\"\",填写信息!A127&\"/\"&填写信息!B127&\"/\"&填写信息!C127))","v":""}]
[{"$nulls":18},{"$f":"IF(填写信息!M128=\"错误\",\"\",IF(填写信息!A128&填写信息!B128=\"\",\"\",填写信息!A128&\"/\"&填写信息!B128&\"/\"&填写信息!C128))","v":""}]
[{"$nulls":18},{"$f":"IF(填写信息!M129=\"错误\",\"\",IF(填写信息!A129&填写信息!B129=\"\",\"\",填写信息!A129&\"/\"&填写信息!B129&\"/\"&填写信息!C129))","v":""}]
[{"$nulls":18},{"$f":"IF(填写信息!M130=\"错误\",\"\",IF(填写信息!A130&填写信息!B130=\"\",\"\",填写信息!A130&\"/\"&填写信息!B130&\"/\"&填写信息!C130))","v":""}]
[{"$nulls":18},{"$f":"IF(填写信息!M131=\"错误\",\"\",IF(填写信息!A131&填写信息!B131=\"\",\"\",填写信息!A131&\"/\"&填写信息!B131&\"/\"&填写信息!C131))","v":""}]
[{"$nulls":18},{"$f":"IF(填写信息!M132=\"错误\",\"\",IF(填写信息!A132&填写信息!B132=\"\",\"\",填写信息!A132&\"/\"&填写信息!B132&\"/\"&填写信息!C132))","v":""}]
[{"$nulls":18},{"$f":"IF(填写信息!M133=\"错误\",\"\",IF(填写信息!A133&填写信息!B133=\"\",\"\",填写信息!A133&\"/\"&填写信息!B133&\"/\"&填写信息!C133))","v":""}]
[{"$nulls":18},{"$f":"IF(填写信息!M134=\"错误\",\"\",IF(填写信息!A134&填写信息!B134=\"\",\"\",填写信息!A134&\"/\"&填写信息!B134&\"/\"&填写信息!C134))","v":""}]
[{"$nulls":18},{"$f":"IF(填写信息!M135=\"错误\",\"\",IF(填写信息!A135&填写信息!B135=\"\",\"\",填写信息!A135&\"/\"&填写信息!B135&\"/\"&填写信息!C135))","v":""}]
[{"$nulls":18},{"$f":"IF(填写信息!M136=\"错误\",\"\",IF(填写信息!A136&填写信息!B136=\"\",\"\",填写信息!A136&\"/\"&填写信息!B136&\"/\"&填写信息!C136))","v":""}]
[{"$nulls":18},{"$f":"IF(填写信息!M137=\"错误\",\"\",IF(填写信息!A137&填写信息!B137=\"\",\"\",填写信息!A137&\"/\"&填写信息!B137&\"/\"&填写信息!C137))","v":""}]
[{"$nulls":18},{"$f":"IF(填写信息!M138=\"错误\",\"\",IF(填写信息!A138&填写信息!B138=\"\",\"\",填写信息!A138&\"/\"&填写信息!B138&\"/\"&填写信息!C138))","v":""}]
[{"$f":"S24&\"    \"&S44&\"    \"&S64","v":"ABCD1234560/EMCABC0001/40HQ        "},{"$nulls":17},{"$f":"IF(填写信息!M139=\"错误\",\"\",IF(填写信息!A139&填写信息!B139=\"\",\"\",填写信息!A139&\"/\"&填写信息!B139&\"/\"&填写信息!C139))","v":""}]
[{"$f":"S25&\"    \"&S45&\"    \"&S65","v":"        "},{"$nulls":17},{"$f":"IF(填写信息!M140=\"错误\",\"\",IF(填写信息!A140&填写信息!B140=\"\",\"\",填写信息!A140&\"/\"&填写信息!B140&\"/\"&填写信息!C140))","v":""}]
["        ",{"$nulls":17},{"$f":"IF(填写信息!M141=\"错误\",\"\",IF(填写信息!A141&填写信息!B141=\"\",\"\",填写信息!A141&\"/\"&填写信息!B141&\"/\"&填写信息!C141))","v":""}]
["        ",{"$nulls":17},{"$f":"IF(填写信息!M142=\"错误\",\"\",IF(填写信息!A142&填写信息!B142=\"\",\"\",填写信息!A142&\"/\"&填写信息!B142&\"/\"&填写信息!C142))","v":""}]
["        ",{"$nulls":17},{"$f":"IF(填写信息!M143=\"错误\",\"\",IF(填写信息!A143&填写信息!B143=\"\",\"\",填写信息!A143&\"/\"&填写信息!B143&\"/\"&填写信息!C143))","v":""}]
["        ",{"$nulls":17},{"$f":"IF(填写信息!M144=\"错误\",\"\",IF(填写信息!A144&填写信息!B144=\"\",\"\",填写信息!A144&\"/\"&填写信息!B144&\"/\"&填写信息!C144))","v":""}]
["        ",{"$nulls":17},{"$f":"IF(填写信息!M145=\"错误\",\"\",IF(填写信息!A145&填写信息!B145=\"\",\"\",填写信息!A145&\"/\"&填写信息!B145&\"/\"&填写信息!C145))","v":""}]
["        ",{"$nulls":17},{"$f":"IF(填写信息!M146=\"错误\",\"\",IF(填写信息!A146&填写信息!B146=\"\",\"\",填写信息!A146&\"/\"&填写信息!B146&\"/\"&填写信息!C146))","v":""}]
["        ",{"$nulls":17},{"$f":"IF(填写信息!M147=\"错误\",\"\",IF(填写信息!A147&填写信息!B147=\"\",\"\",填写信息!A147&\"/\"&填写信息!B147&\"/\"&填写信息!C147))","v":""}]
["        ",{"$nulls":17},{"$f":"IF(填写信息!M148=\"错误\",\"\",IF(填写信息!A148&填写信息!B148=\"\",\"\",填写信息!A148&\"/\"&填写信息!B148&\"/\"&填写信息!C148))","v":""}]
["        ",{"$nulls":17},{"$f":"IF(填写信息!M149=\"错误\",\"\",IF(填写信息!A149&填写信息!B149=\"\",\"\",填写信息!A149&\"/\"&填写信息!B149&\"/\"&填写信息!C149))","v":""}]
["        ",{"$nulls":17},{"$f":"IF(填写信息!M150=\"错误\",\"\",IF(填写信息!A150&填写信息!B150=\"\",\"\",填写信息!A150&\"/\"&填写信息!B150&\"/\"&填写信息!C150))","v":""}]
["        ",{"$nulls":17},{"$f":"IF(填写信息!M151=\"错误\",\"\",IF(填写信息!A151&填写信息!B151=\"\",\"\",填写信息!A151&\"/\"&填写信息!B151&\"/\"&填写信息!C151))","v":""}]
["        ",{"$nulls":17},{"$f":"IF(填写信息!M152=\"错误\",\"\",IF(填写信息!A152&填写信息!B152=\"\",\"\",填写信息!A152&\"/\"&填写信息!B152&\"/\"&填写信息!C152))","v":""}]
["        ",{"$nulls":17},{"$f":"IF(填写信息!M153=\"错误\",\"\",IF(填写信息!A153&填写信息!B153=\"\",\"\",填写信息!A153&\"/\"&填写信息!B153&\"/\"&填写信息!C153))","v":""}]
["        ",{"$nulls":17},{"$f":"IF(填写信息!M154=\"错误\",\"\",IF(填写信息!A154&填写信息!B154=\"\",\"\",填写信息!A154&\"/\"&填写信息!B154&\"/\"&填写信息!C154))","v":""}]
["        ",{"$nulls":17},{"$f":"IF(填写信息!M155=\"错误\",\"\",IF(填写信息!A155&填写信息!B155=\"\",\"\",填写信息!A155&\"/\"&填写信息!B155&\"/\"&填写信息!C155))","v":""}]
["        ",{"$nulls":17},{"$f":"IF(填写信息!M156=\"错误\",\"\",IF(填写信息!A156&填写信息!B156=\"\",\"\",填写信息!A156&\"/\"&填写信息!B156&\"/\"&填写信息!C156))","v":""}]
["        ",{"$nulls":17},{"$f":"IF(填写信息!M157=\"错误\",\"\",IF(填写信息!A157&填写信息!B157=\"\",\"\",填写信息!A157&\"/\"&填写信息!B157&\"/\"&填写信息!C157))","v":""}]
["        ",{"$nulls":17},{"$f":"IF(填写信息!M158=\"错误\",\"\",IF(填写信息!A158&填写信息!B158=\"\",\"\",填写信息!A158&\"/\"&填写信息!B158&\"/\"&填写信息!C158))","v":""}]
[{"$nulls":18},{"$f":"IF(填写信息!M159=\"错误\",\"\",IF(填写信息!A159&填写信息!B159=\"\",\"\",填写信息!A159&\"/\"&填写信息!B159&\"/\"&填写信息!C159))","v":""}]
[{"$f":"S84&\"    \"&S104","v":"    "},{"$nulls":17},{"$f":"IF(填写信息!M160=\"错误\",\"\",IF(填写信息!A160&填写信息!B160=\"\",\"\",填写信息!A160&\"/\"&填写信息!B160&\"/\"&填写信息!C160))","v":""}]
[{"$f":"S85&\"    \"&S105","v":"    "},{"$nulls":17},{"$f":"IF(填写信息!M161=\"错误\",\"\",IF(填写信息!A161&填写信息!B161=\"\",\"\",填写信息!A161&\"/\"&填写信息!B161&\"/\"&填写信息!C161))","v":""}]
["    ",{"$nulls":17},{"$f":"IF(填写信息!M162=\"错误\",\"\",IF(填写信息!A162&填写信息!B162=\"\",\"\",填写信息!A162&\"/\"&填写信息!B162&\"/\"&填写信息!C162))","v":""}]
["    ",{"$nulls":17},{"$f":"IF(填写信息!M163=\"错误\",\"\",IF(填写信息!A163&填写信息!B163=\"\",\"\",填写信息!A163&\"/\"&填写信息!B163&\"/\"&填写信息!C163))","v":""}]
["    ",{"$nulls":17},{"$f":"IF(填写信息!M164=\"错误\",\"\",IF(填写信息!A164&填写信息!B164=\"\",\"\",填写信息!A164&\"/\"&填写信息!B164&\"/\"&填写信息!C164))","v":""}]
["    ",{"$nulls":17},{"$f":"IF(填写信息!M165=\"错误\",\"\",IF(填写信息!A165&填写信息!B165=\"\",\"\",填写信息!A165&\"/\"&填写信息!B165&\"/\"&填写信息!C165))","v":""}]
["    ",{"$nulls":17},{"$f":"IF(填写信息!M166=\"错误\",\"\",IF(填写信息!A166&填写信息!B166=\"\",\"\",填写信息!A166&\"/\"&填写信息!B166&\"/\"&填写信息!C166))","v":""}]
["    ",{"$nulls":17},{"$f":"IF(填写信息!M167=\"错误\",\"\",IF(填写信息!A167&填写信息!B167=\"\",\"\",填写信息!A167&\"/\"&填写信息!B167&\"/\"&填写信息!C167))","v":""}]
["    ",{"$nulls":17},{"$f":"IF(填写信息!M168=\"错误\",\"\",IF(填写信息!A168&填写信息!B168=\"\",\"\",填写信息!A168&\"/\"&填写信息!B168&\"/\"&填写信息!C168))","v":""}]
["    ",{"$nulls":17},{"$f":"IF(填写信息!M169=\"错误\",\"\",IF(填写信息!A169&填写信息!B169=\"\",\"\",填写信息!A169&\"/\"&填写信息!B169&\"/\"&填写信息!C169))","v":""}]
["    ",{"$nulls":17},{"$f":"IF(填写信息!M170=\"错误\",\"\",IF(填写信息!A170&填写信息!B170=\"\",\"\",填写信息!A170&\"/\"&填写信息!B170&\"/\"&填写信息!C170))","v":""}]
["    ",{"$nulls":17},{"$f":"IF(填写信息!M171=\"错误\",\"\",IF(填写信息!A171&填写信息!B171=\"\",\"\",填写信息!A171&\"/\"&填写信息!B171&\"/\"&填写信息!C171))","v":""}]
["    ",{"$nulls":17},{"$f":"IF(填写信息!M172=\"错误\",\"\",IF(填写信息!A172&填写信息!B172=\"\",\"\",填写信息!A172&\"/\"&填写信息!B172&\"/\"&填写信息!C172))","v":""}]
["    ",{"$nulls":17},{"$f":"IF(填写信息!M173=\"错误\",\"\",IF(填写信息!A173&填写信息!B173=\"\",\"\",填写信息!A173&\"/\"&填写信息!B173&\"/\"&填写信息!C173))","v":""}]
["    ",{"$nulls":17},{"$f":"IF(填写信息!M174=\"错误\",\"\",IF(填写信息!A174&填写信息!B174=\"\",\"\",填写信息!A174&\"/\"&填写信息!B174&\"/\"&填写信息!C174))","v":""}]
["    ",{"$nulls":17},{"$f":"IF(填写信息!M175=\"错误\",\"\",IF(填写信息!A175&填写信息!B175=\"\",\"\",填写信息!A175&\"/\"&填写信息!B175&\"/\"&填写信息!C175))","v":""}]
["    ",{"$nulls":17},{"$f":"IF(填写信息!M176=\"错误\",\"\",IF(填写信息!A176&填写信息!B176=\"\",\"\",填写信息!A176&\"/\"&填写信息!B176&\"/\"&填写信息!C176))","v":""}]
["    ",{"$nulls":17},{"$f":"IF(填写信息!M177=\"错误\",\"\",IF(填写信息!A177&填写信息!B177=\"\",\"\",填写信息!A177&\"/\"&填写信息!B177&\"/\"&填写信息!C177))","v":""}]
["    ",{"$nulls":17},{"$f":"IF(填写信息!M178=\"错误\",\"\",IF(填写信息!A178&填写信息!B178=\"\",\"\",填写信息!A178&\"/\"&填写信息!B178&\"/\"&填写信息!C178))","v":""}]
["    ",{"$nulls":17},{"$f":"IF(填写信息!M179=\"错误\",\"\",IF(填写信息!A179&填写信息!B179=\"\",\"\",填写信息!A179&\"/\"&填写信息!B179&\"/\"&填写信息!C179))","v":""}]
[{"$nulls":18},{"$f":"IF(填写信息!M180=\"错误\",\"\",IF(填写信息!A180&填写信息!B180=\"\",\"\",填写信息!A180&\"/\"&填写信息!B180&\"/\"&填写信息!C180))","v":""}]
[{"$nulls":18},{"$f":"IF(填写信息!M181=\"错误\",\"\",IF(填写信息!A181&填写信息!B181=\"\",\"\",填写信息!A181&\"/\"&填写信息!B181&\"/\"&填写信息!C181))","v":""}]
[{"$nulls":18},{"$f":"IF(填写信息!M182=\"错误\",\"\",IF(填写信息!A182&填写信息!B182=\"\",\"\",填写信息!A182&\"/\"&填写信息!B182&\"/\"&填写信息!C182))","v":""}]
[{"$nulls":18},{"$f":"IF(填写信息!M183=\"错误\",\"\",IF(填写信息!A183&填写信息!B183=\"\",\"\",填写信息!A183&\"/\"&填写信息!B183&\"/\"&填写信息!C183))","v":""}]
[{"$nulls":18},{"$f":"IF(填写信息!M184=\"错误\",\"\",IF(填写信息!A184&填写信息!B184=\"\",\"\",填写信息!A184&\"/\"&填写信息!B184&\"/\"&填写信息!C184))","v":""}]
[{"$nulls":18},{"$f":"IF(填写信息!M185=\"错误\",\"\",IF(填写信息!A185&填写信息!B185=\"\",\"\",填写信息!A185&\"/\"&填写信息!B185&\"/\"&填写信息!C185))","v":""}]
[{"$nulls":18},{"$f":"IF(填写信息!M186=\"错误\",\"\",IF(填写信息!A186&填写信息!B186=\"\",\"\",填写信息!A186&\"/\"&填写信息!B186&\"/\"&填写信息!C186))","v":""}]
[{"$nulls":18},{"$f":"IF(填写信息!M187=\"错误\",\"\",IF(填写信息!A187&填写信息!B187=\"\",\"\",填写信息!A187&\"/\"&填写信息!B187&\"/\"&填写信息!C187))","v":""}]
[{"$nulls":18},{"$f":"IF(填写信息!M188=\"错误\",\"\",IF(填写信息!A188&填写信息!B188=\"\",\"\",填写信息!A188&\"/\"&填写信息!B188&\"/\"&填写信息!C188))","v":""}]
[{"$nulls":18},{"$f":"IF(填写信息!M189=\"错误\",\"\",IF(填写信息!A189&填写信息!B189=\"\",\"\",填写信息!A189&\"/\"&填写信息!B189&\"/\"&填写信息!C189))","v":""}]
[{"$nulls":18},{"$f":"IF(填写信息!M190=\"错误\",\"\",IF(填写信息!A190&填写信息!B190=\"\",\"\",填写信息!A190&\"/\"&填写信息!B190&\"/\"&填写信息!C190))","v":""}]
[{"$nulls":18},{"$f":"IF(填写信息!M191=\"错误\",\"\",IF(填写信息!A191&填写信息!B191=\"\",\"\",填写信息!A191&\"/\"&填写信息!B191&\"/\"&填写信息!C191))","v":""}]
[{"$nulls":18},{"$f":"IF(填写信息!M192=\"错误\",\"\",IF(填写信息!A192&填写信息!B192=\"\",\"\",填写信息!A192&\"/\"&填写信息!B192&\"/\"&填写信息!C192))","v":""}]
[{"$nulls":18},{"$f":"IF(填写信息!M193=\"错误\",\"\",IF(填写信息!A193&填写信息!B193=\"\",\"\",填写信息!A193&\"/\"&填写信息!B193&\"/\"&填写信息!C193))","v":""}]
[{"$nulls":18},{"$f":"IF(填写信息!M194=\"错误\",\"\",IF(填写信息!A194&填写信息!B194=\"\",\"\",填写信息!A194&\"/\"&填写信息!B194&\"/\"&填写信息!C194))","v":""}]
[{"$nulls":18},{"$f":"IF(填写信息!M195=\"错误\",\"\",IF(填写信息!A195&填写信息!B195=\"\",\"\",填写信息!A195&\"/\"&填写信息!B195&\"/\"&填写信息!C195))","v":""}]
[{"$nulls":18},{"$f":"IF(填写信息!M196=\"错误\",\"\",IF(填写信息!A196&填写信息!B196=\"\",\"\",填写信息!A196&\"/\"&填写信息!B196&\"/\"&填写信息!C196))","v":""}]
[{"$nulls":18},{"$f":"IF(填写信息!M197=\"错误\",\"\",IF(填写信息!A197&填写信息!B197=\"\",\"\",填写信息!A197&\"/\"&填写信息!B197&\"/\"&填写信息!C197))","v":""}]
[{"$nulls":18},{"$f":"IF(填写信息!M198=\"错误\",\"\",IF(填写信息!A198&填写信息!B198=\"\",\"\",填写信息!A198&\"/\"&填写信息!B198&\"/\"&填写信息!C198))","v":""}]
[{"$nulls":18},{"$f":"IF(填写信息!M199=\"错误\",\"\",IF(填写信息!A199&填写信息!B199=\"\",\"\",填写信息!A199&\"/\"&填写信息!B199&\"/\"&填写信息!C199))","v":""}]
[{"$nulls":18},{"$f":"IF(填写信息!M200=\"错误\",\"\",IF(填写信息!A200&填写信息!B200=\"\",\"\",填写信息!A200&\"/\"&填写信息!B200&\"/\"&填写信息!C200))","v":""}]
[{"$nulls":18},{"$f":"IF(填写信息!M201=\"错误\",\"\",IF(填写信息!A201&填写信息!B201=\"\",\"\",填写信息!A201&\"/\"&填写信息!B201&\"/\"&填写信息!C201))","v":""}]
[{"$nulls":18},{"$f":"IF(填写信息!M202=\"错误\",\"\",IF(填写信息!A202&填写信息!B202=\"\",\"\",填写信息!A202&\"/\"&填写信息!B202&\"/\"&填写信息!C202))","v":""}]
[{"$nulls":18},{"$f":"IF(填写信息!M203=\"错误\",\"\",IF(填写信息!A203&填写信息!B203=\"\",\"\",填写信息!A203&\"/\"&填写信息!B203&\"/\"&填写信息!C203))","v":""}]
[{"$nulls":18},{"$f":"IF(填写信息!M204=\"错误\",\"\",IF(填写信息!A204&填写信息!B204=\"\",\"\",填写信息!A204&\"/\"&填写信息!B204&\"/\"&填写信息!C204))","v":""}]
[{"$nulls":18},{"$f":"IF(填写信息!M205=\"错误\",\"\",IF(填写信息!A205&填写信息!B205=\"\",\"\",填写信息!A205&\"/\"&填写信息!B205&\"/\"&填写信息!C205))","v":""}]
[{"$nulls":18},{"$f":"IF(填写信息!M206=\"错误\",\"\",IF(填写信息!A206&填写信息!B206=\"\",\"\",填写信息!A206&\"/\"&填写信息!B206&\"/\"&填写信息!C206))","v":""}]
[{"$nulls":18},{"$f":"IF(填写信息!M207=\"错误\",\"\",IF(填写信息!A207&填写信息!B207=\"\",\"\",填写信息!A207&\"/\"&填写信息!B207&\"/\"&填写信息!C207))","v":""}]
[{"$nulls":18},{"$f":"IF(填写信息!M208=\"错误\",\"\",IF(填写信息!A208&填写信息!B208=\"\",\"\",填写信息!A208&\"/\"&填写信息!B208&\"/\"&填写信息!C208))","v":""}]
[{"$nulls":18},{"$f":"IF(填写信息!M209=\"错误\",\"\",IF(填写信息!A209&填写信息!B209=\"\",\"\",填写信息!A209&\"/\"&填写信息!B209&\"/\"&填写信息!C209))","v":""}]
[{"$nulls":18},{"$f":"IF(填写信息!M210=\"错误\",\"\",IF(填写信息!A210&填写信息!B210=\"\",\"\",填写信息!A210&\"/\"&填写信息!B210&\"/\"&填写信息!C210))","v":""}]
[{"$nulls":18},{"$f":"IF(填写信息!M211=\"错误\",\"\",IF(填写信息!A211&填写信息!B211=\"\",\"\",填写信息!A211&\"/\"&填写信息!B211&\"/\"&填写信息!C211))","v":""}]
[{"$nulls":18},{"$f":"IF(填写信息!M212=\"错误\",\"\",IF(填写信息!A212&填写信息!B212=\"\",\"\",填写信息!A212&\"/\"&填写信息!B212&\"/\"&填写信息!C212))","v":""}]
[{"$nulls":18},{"$f":"IF(填写信息!M213=\"错误\",\"\",IF(填写信息!A213&填写信息!B213=\"\",\"\",填写信息!A213&\"/\"&填写信息!B213&\"/\"&填写信息!C213))","v":""}]
[{"$nulls":18},{"$f":"IF(填写信息!M214=\"错误\",\"\",IF(填写信息!A214&填写信息!B214=\"\",\"\",填写信息!A214&\"/\"&填写信息!B214&\"/\"&填写信息!C214))","v":""}]
[{"$nulls":18},{"$f":"IF(填写信息!M215=\"错误\",\"\",IF(填写信息!A215&填写信息!B215=\"\",\"\",填写信息!A215&\"/\"&填写信息!B215&\"/\"&填写信息!C215))","v":""}]
[{"$nulls":18},{"$f":"IF(填写信息!M216=\"错误\",\"\",IF(填写信息!A216&填写信息!B216=\"\",\"\",填写信息!A216&\"/\"&填写信息!B216&\"/\"&填写信息!C216))","v":""}]

{"sheet":"运抵报告","index":4,"n_rows":104,"n_cols":27,"rows_kept":104,"cut":false,"hidden":false,"merged":[]}
["海关出口船舶编码",{"$f":"TRIM(SUBSTITUTE(MID(MID(填写信息!B20,FIND(\"(\",SUBSTITUTE(SUBSTITUTE(填写信息!B20,\"（\",\"(\"),\"）\",\")\")),11),2,11),\")\",\"\"))","v":{"$error":"#VALUE!"}},"海关出口航次编码",{"$f":"填写信息!B21","v":"0274519B"}]
["船名",{"$f":"LEFT(填写信息!B20,FIND(\"(\",SUBSTITUTE(填写信息!B20,\"（\",\"(\"))-1)","v":{"$error":"#VALUE!"}},"航次",{"$f":"填写信息!B21","v":"0274519B"}]
["箱号","箱主","进港类型","商业属性","箱类型","尺寸","箱型","箱高","空重","货代","订舱号","卸货港","目的港","总重","重箱标识","特殊配载","单证备注","危品等级1","联合国编码1","危品等级2","联合国编码2","危品等级3","联合国编码3","冻柜温度","超限","核对标识","铅封号"]
[{"$f":"填写信息!A97&\"\"","v":"ABCD1234560"},{"$nulls":9},{"$f":"IF(A4=\"\",\"\",填写信息!B$3)","v":"156000888887"},{"$nulls":15},{"$f":"填写信息!B97&\"\"","v":"EMCABC0001"}]
[{"$f":"填写信息!A98&\"\"","v":""},{"$nulls":9},{"$f":"IF(A5=\"\",\"\",填写信息!B$3)","v":""},{"$nulls":15},{"$f":"填写信息!B98&\"\"","v":""}]
[{"$f":"填写信息!A99&\"\"","v":""},{"$nulls":9},{"$f":"IF(A6=\"\",\"\",填写信息!B$3)","v":""},{"$nulls":15},{"$f":"填写信息!B99&\"\"","v":""}]
[{"$f":"填写信息!A100&\"\"","v":""},{"$nulls":9},{"$f":"IF(A7=\"\",\"\",填写信息!B$3)","v":""},{"$nulls":15},{"$f":"填写信息!B100&\"\"","v":""}]
[{"$f":"填写信息!A101&\"\"","v":""},{"$nulls":9},{"$f":"IF(A8=\"\",\"\",填写信息!B$3)","v":""},{"$nulls":15},{"$f":"填写信息!B101&\"\"","v":""}]
[{"$f":"填写信息!A102&\"\"","v":""},{"$nulls":9},{"$f":"IF(A9=\"\",\"\",填写信息!B$3)","v":""},{"$nulls":15},{"$f":"填写信息!B102&\"\"","v":""}]
[{"$f":"填写信息!A103&\"\"","v":""},{"$nulls":9},{"$f":"IF(A10=\"\",\"\",填写信息!B$3)","v":""},{"$nulls":15},{"$f":"填写信息!B103&\"\"","v":""}]
[{"$f":"填写信息!A104&\"\"","v":""},{"$nulls":9},{"$f":"IF(A11=\"\",\"\",填写信息!B$3)","v":""},{"$nulls":15},{"$f":"填写信息!B104&\"\"","v":""}]
[{"$f":"填写信息!A105&\"\"","v":""},{"$nulls":9},{"$f":"IF(A12=\"\",\"\",填写信息!B$3)","v":""},{"$nulls":15},{"$f":"填写信息!B105&\"\"","v":""}]
[{"$f":"填写信息!A106&\"\"","v":""},{"$nulls":9},{"$f":"IF(A13=\"\",\"\",填写信息!B$3)","v":""},{"$nulls":15},{"$f":"填写信息!B106&\"\"","v":""}]
[{"$f":"填写信息!A107&\"\"","v":""},{"$nulls":9},{"$f":"IF(A14=\"\",\"\",填写信息!B$3)","v":""},{"$nulls":15},{"$f":"填写信息!B107&\"\"","v":""}]
[{"$f":"填写信息!A108&\"\"","v":""},{"$nulls":9},{"$f":"IF(A15=\"\",\"\",填写信息!B$3)","v":""},{"$nulls":15},{"$f":"填写信息!B108&\"\"","v":""}]
[{"$f":"填写信息!A109&\"\"","v":""},{"$nulls":9},{"$f":"IF(A16=\"\",\"\",填写信息!B$3)","v":""},{"$nulls":15},{"$f":"填写信息!B109&\"\"","v":""}]
[{"$f":"填写信息!A110&\"\"","v":""},{"$nulls":9},{"$f":"IF(A17=\"\",\"\",填写信息!B$3)","v":""},{"$nulls":15},{"$f":"填写信息!B110&\"\"","v":""}]
[{"$f":"填写信息!A111&\"\"","v":""},{"$nulls":9},{"$f":"IF(A18=\"\",\"\",填写信息!B$3)","v":""},{"$nulls":15},{"$f":"填写信息!B111&\"\"","v":""}]
[{"$f":"填写信息!A112&\"\"","v":""},{"$nulls":9},{"$f":"IF(A19=\"\",\"\",填写信息!B$3)","v":""},{"$nulls":15},{"$f":"填写信息!B112&\"\"","v":""}]
[{"$f":"填写信息!A113&\"\"","v":""},{"$nulls":9},{"$f":"IF(A20=\"\",\"\",填写信息!B$3)","v":""},{"$nulls":15},{"$f":"填写信息!B113&\"\"","v":""}]
[{"$f":"填写信息!A114&\"\"","v":""},{"$nulls":9},{"$f":"IF(A21=\"\",\"\",填写信息!B$3)","v":""},{"$nulls":15},{"$f":"填写信息!B114&\"\"","v":""}]
[{"$f":"填写信息!A115&\"\"","v":""},{"$nulls":9},{"$f":"IF(A22=\"\",\"\",填写信息!B$3)","v":""},{"$nulls":15},{"$f":"填写信息!B115&\"\"","v":""}]
[{"$f":"填写信息!A116&\"\"","v":""},{"$nulls":9},{"$f":"IF(A23=\"\",\"\",填写信息!B$3)","v":""},{"$nulls":15},{"$f":"填写信息!B116&\"\"","v":""}]
[{"$f":"填写信息!A117&\"\"","v":""},{"$nulls":9},{"$f":"IF(A24=\"\",\"\",填写信息!B$3)","v":""},{"$nulls":15},{"$f":"填写信息!B117&\"\"","v":""}]
[{"$f":"填写信息!A118&\"\"","v":""},{"$nulls":9},{"$f":"IF(A25=\"\",\"\",填写信息!B$3)","v":""},{"$nulls":15},{"$f":"填写信息!B118&\"\"","v":""}]
[{"$f":"填写信息!A119&\"\"","v":""},{"$nulls":9},{"$f":"IF(A26=\"\",\"\",填写信息!B$3)","v":""},{"$nulls":15},{"$f":"填写信息!B119&\"\"","v":""}]
[{"$f":"填写信息!A120&\"\"","v":""},{"$nulls":9},{"$f":"IF(A27=\"\",\"\",填写信息!B$3)","v":""},{"$nulls":15},{"$f":"填写信息!B120&\"\"","v":""}]
[{"$f":"填写信息!A121&\"\"","v":""},{"$nulls":9},{"$f":"IF(A28=\"\",\"\",填写信息!B$3)","v":""},{"$nulls":15},{"$f":"填写信息!B121&\"\"","v":""}]
[{"$f":"填写信息!A122&\"\"","v":""},{"$nulls":9},{"$f":"IF(A29=\"\",\"\",填写信息!B$3)","v":""},{"$nulls":15},{"$f":"填写信息!B122&\"\"","v":""}]
[{"$f":"填写信息!A123&\"\"","v":""},{"$nulls":9},{"$f":"IF(A30=\"\",\"\",填写信息!B$3)","v":""},{"$nulls":15},{"$f":"填写信息!B123&\"\"","v":""}]
[{"$f":"填写信息!A124&\"\"","v":""},{"$nulls":9},{"$f":"IF(A31=\"\",\"\",填写信息!B$3)","v":""},{"$nulls":15},{"$f":"填写信息!B124&\"\"","v":""}]
[{"$f":"填写信息!A125&\"\"","v":""},{"$nulls":9},{"$f":"IF(A32=\"\",\"\",填写信息!B$3)","v":""},{"$nulls":15},{"$f":"填写信息!B125&\"\"","v":""}]
[{"$f":"填写信息!A126&\"\"","v":""},{"$nulls":9},{"$f":"IF(A33=\"\",\"\",填写信息!B$3)","v":""},{"$nulls":15},{"$f":"填写信息!B126&\"\"","v":""}]
[{"$f":"填写信息!A127&\"\"","v":""},{"$nulls":9},{"$f":"IF(A34=\"\",\"\",填写信息!B$3)","v":""},{"$nulls":15},{"$f":"填写信息!B127&\"\"","v":""}]
[{"$f":"填写信息!A128&\"\"","v":""},{"$nulls":9},{"$f":"IF(A35=\"\",\"\",填写信息!B$3)","v":""},{"$nulls":15},{"$f":"填写信息!B128&\"\"","v":""}]
[{"$f":"填写信息!A129&\"\"","v":""},{"$nulls":9},{"$f":"IF(A36=\"\",\"\",填写信息!B$3)","v":""},{"$nulls":15},{"$f":"填写信息!B129&\"\"","v":""}]
[{"$f":"填写信息!A130&\"\"","v":""},{"$nulls":9},{"$f":"IF(A37=\"\",\"\",填写信息!B$3)","v":""},{"$nulls":15},{"$f":"填写信息!B130&\"\"","v":""}]
[{"$f":"填写信息!A131&\"\"","v":""},{"$nulls":9},{"$f":"IF(A38=\"\",\"\",填写信息!B$3)","v":""},{"$nulls":15},{"$f":"填写信息!B131&\"\"","v":""}]
[{"$f":"填写信息!A132&\"\"","v":""},{"$nulls":9},{"$f":"IF(A39=\"\",\"\",填写信息!B$3)","v":""},{"$nulls":15},{"$f":"填写信息!B132&\"\"","v":""}]
[{"$f":"填写信息!A133&\"\"","v":""},{"$nulls":9},{"$f":"IF(A40=\"\",\"\",填写信息!B$3)","v":""},{"$nulls":15},{"$f":"填写信息!B133&\"\"","v":""}]
[{"$f":"填写信息!A134&\"\"","v":""},{"$nulls":9},{"$f":"IF(A41=\"\",\"\",填写信息!B$3)","v":""},{"$nulls":15},{"$f":"填写信息!B134&\"\"","v":""}]
[{"$f":"填写信息!A135&\"\"","v":""},{"$nulls":9},{"$f":"IF(A42=\"\",\"\",填写信息!B$3)","v":""},{"$nulls":15},{"$f":"填写信息!B135&\"\"","v":""}]
[{"$f":"填写信息!A136&\"\"","v":""},{"$nulls":9},{"$f":"IF(A43=\"\",\"\",填写信息!B$3)","v":""},{"$nulls":15},{"$f":"填写信息!B136&\"\"","v":""}]
[{"$f":"填写信息!A137&\"\"","v":""},{"$nulls":9},{"$f":"IF(A44=\"\",\"\",填写信息!B$3)","v":""},{"$nulls":15},{"$f":"填写信息!B137&\"\"","v":""}]
[{"$f":"填写信息!A138&\"\"","v":""},{"$nulls":9},{"$f":"IF(A45=\"\",\"\",填写信息!B$3)","v":""},{"$nulls":15},{"$f":"填写信息!B138&\"\"","v":""}]
[{"$f":"填写信息!A139&\"\"","v":""},{"$nulls":9},{"$f":"IF(A46=\"\",\"\",填写信息!B$3)","v":""},{"$nulls":15},{"$f":"填写信息!B139&\"\"","v":""}]
[{"$f":"填写信息!A140&\"\"","v":""},{"$nulls":9},{"$f":"IF(A47=\"\",\"\",填写信息!B$3)","v":""},{"$nulls":15},{"$f":"填写信息!B140&\"\"","v":""}]
[{"$f":"填写信息!A141&\"\"","v":""},{"$nulls":9},{"$f":"IF(A48=\"\",\"\",填写信息!B$3)","v":""},{"$nulls":15},{"$f":"填写信息!B141&\"\"","v":""}]
[{"$f":"填写信息!A142&\"\"","v":""},{"$nulls":9},{"$f":"IF(A49=\"\",\"\",填写信息!B$3)","v":""},{"$nulls":15},{"$f":"填写信息!B142&\"\"","v":""}]
[{"$f":"填写信息!A143&\"\"","v":""},{"$nulls":9},{"$f":"IF(A50=\"\",\"\",填写信息!B$3)","v":""},{"$nulls":15},{"$f":"填写信息!B143&\"\"","v":""}]
[{"$f":"填写信息!A144&\"\"","v":""},{"$nulls":9},{"$f":"IF(A51=\"\",\"\",填写信息!B$3)","v":""},{"$nulls":15},{"$f":"填写信息!B144&\"\"","v":""}]
[{"$f":"填写信息!A145&\"\"","v":""},{"$nulls":9},{"$f":"IF(A52=\"\",\"\",填写信息!B$3)","v":""},{"$nulls":15},{"$f":"填写信息!B145&\"\"","v":""}]
[{"$f":"填写信息!A146&\"\"","v":""},{"$nulls":9},{"$f":"IF(A53=\"\",\"\",填写信息!B$3)","v":""},{"$nulls":15},{"$f":"填写信息!B146&\"\"","v":""}]
[{"$f":"填写信息!A147&\"\"","v":""},{"$nulls":9},{"$f":"IF(A54=\"\",\"\",填写信息!B$3)","v":""},{"$nulls":15},{"$f":"填写信息!B147&\"\"","v":""}]
[{"$f":"填写信息!A148&\"\"","v":""},{"$nulls":9},{"$f":"IF(A55=\"\",\"\",填写信息!B$3)","v":""},{"$nulls":15},{"$f":"填写信息!B148&\"\"","v":""}]
[{"$f":"填写信息!A149&\"\"","v":""},{"$nulls":9},{"$f":"IF(A56=\"\",\"\",填写信息!B$3)","v":""},{"$nulls":15},{"$f":"填写信息!B149&\"\"","v":""}]
[{"$f":"填写信息!A150&\"\"","v":""},{"$nulls":9},{"$f":"IF(A57=\"\",\"\",填写信息!B$3)","v":""},{"$nulls":15},{"$f":"填写信息!B150&\"\"","v":""}]
[{"$f":"填写信息!A151&\"\"","v":""},{"$nulls":9},{"$f":"IF(A58=\"\",\"\",填写信息!B$3)","v":""},{"$nulls":15},{"$f":"填写信息!B151&\"\"","v":""}]
[{"$f":"填写信息!A152&\"\"","v":""},{"$nulls":9},{"$f":"IF(A59=\"\",\"\",填写信息!B$3)","v":""},{"$nulls":15},{"$f":"填写信息!B152&\"\"","v":""}]
[{"$f":"填写信息!A153&\"\"","v":""},{"$nulls":9},{"$f":"IF(A60=\"\",\"\",填写信息!B$3)","v":""},{"$nulls":15},{"$f":"填写信息!B153&\"\"","v":""}]
[{"$f":"填写信息!A154&\"\"","v":""},{"$nulls":9},{"$f":"IF(A61=\"\",\"\",填写信息!B$3)","v":""},{"$nulls":15},{"$f":"填写信息!B154&\"\"","v":""}]
[{"$f":"填写信息!A155&\"\"","v":""},{"$nulls":9},{"$f":"IF(A62=\"\",\"\",填写信息!B$3)","v":""},{"$nulls":15},{"$f":"填写信息!B155&\"\"","v":""}]
[{"$f":"填写信息!A156&\"\"","v":""},{"$nulls":9},{"$f":"IF(A63=\"\",\"\",填写信息!B$3)","v":""},{"$nulls":15},{"$f":"填写信息!B156&\"\"","v":""}]
[{"$f":"填写信息!A157&\"\"","v":""},{"$nulls":9},{"$f":"IF(A64=\"\",\"\",填写信息!B$3)","v":""},{"$nulls":15},{"$f":"填写信息!B157&\"\"","v":""}]
[{"$f":"填写信息!A158&\"\"","v":""},{"$nulls":9},{"$f":"IF(A65=\"\",\"\",填写信息!B$3)","v":""},{"$nulls":15},{"$f":"填写信息!B158&\"\"","v":""}]
[{"$f":"填写信息!A159&\"\"","v":""},{"$nulls":9},{"$f":"IF(A66=\"\",\"\",填写信息!B$3)","v":""},{"$nulls":15},{"$f":"填写信息!B159&\"\"","v":""}]
[{"$f":"填写信息!A160&\"\"","v":""},{"$nulls":9},{"$f":"IF(A67=\"\",\"\",填写信息!B$3)","v":""},{"$nulls":15},{"$f":"填写信息!B160&\"\"","v":""}]
[{"$f":"填写信息!A161&\"\"","v":""},{"$nulls":9},{"$f":"IF(A68=\"\",\"\",填写信息!B$3)","v":""},{"$nulls":15},{"$f":"填写信息!B161&\"\"","v":""}]
[{"$f":"填写信息!A162&\"\"","v":""},{"$nulls":9},{"$f":"IF(A69=\"\",\"\",填写信息!B$3)","v":""},{"$nulls":15},{"$f":"填写信息!B162&\"\"","v":""}]
[{"$f":"填写信息!A163&\"\"","v":""},{"$nulls":9},{"$f":"IF(A70=\"\",\"\",填写信息!B$3)","v":""},{"$nulls":15},{"$f":"填写信息!B163&\"\"","v":""}]
[{"$f":"填写信息!A164&\"\"","v":""},{"$nulls":9},{"$f":"IF(A71=\"\",\"\",填写信息!B$3)","v":""},{"$nulls":15},{"$f":"填写信息!B164&\"\"","v":""}]
[{"$f":"填写信息!A165&\"\"","v":""},{"$nulls":9},{"$f":"IF(A72=\"\",\"\",填写信息!B$3)","v":""},{"$nulls":15},{"$f":"填写信息!B165&\"\"","v":""}]
[{"$f":"填写信息!A166&\"\"","v":""},{"$nulls":9},{"$f":"IF(A73=\"\",\"\",填写信息!B$3)","v":""},{"$nulls":15},{"$f":"填写信息!B166&\"\"","v":""}]
[{"$f":"填写信息!A167&\"\"","v":""},{"$nulls":9},{"$f":"IF(A74=\"\",\"\",填写信息!B$3)","v":""},{"$nulls":15},{"$f":"填写信息!B167&\"\"","v":""}]
[{"$f":"填写信息!A168&\"\"","v":""},{"$nulls":9},{"$f":"IF(A75=\"\",\"\",填写信息!B$3)","v":""},{"$nulls":15},{"$f":"填写信息!B168&\"\"","v":""}]
[{"$f":"填写信息!A169&\"\"","v":""},{"$nulls":9},{"$f":"IF(A76=\"\",\"\",填写信息!B$3)","v":""},{"$nulls":15},{"$f":"填写信息!B169&\"\"","v":""}]
[{"$f":"填写信息!A170&\"\"","v":""},{"$nulls":9},{"$f":"IF(A77=\"\",\"\",填写信息!B$3)","v":""},{"$nulls":15},{"$f":"填写信息!B170&\"\"","v":""}]
[{"$f":"填写信息!A171&\"\"","v":""},{"$nulls":9},{"$f":"IF(A78=\"\",\"\",填写信息!B$3)","v":""},{"$nulls":15},{"$f":"填写信息!B171&\"\"","v":""}]
[{"$f":"填写信息!A172&\"\"","v":""},{"$nulls":9},{"$f":"IF(A79=\"\",\"\",填写信息!B$3)","v":""},{"$nulls":15},{"$f":"填写信息!B172&\"\"","v":""}]
[{"$f":"填写信息!A173&\"\"","v":""},{"$nulls":9},{"$f":"IF(A80=\"\",\"\",填写信息!B$3)","v":""},{"$nulls":15},{"$f":"填写信息!B173&\"\"","v":""}]
[{"$f":"填写信息!A174&\"\"","v":""},{"$nulls":9},{"$f":"IF(A81=\"\",\"\",填写信息!B$3)","v":""},{"$nulls":15},{"$f":"填写信息!B174&\"\"","v":""}]
[{"$f":"填写信息!A175&\"\"","v":""},{"$nulls":9},{"$f":"IF(A82=\"\",\"\",填写信息!B$3)","v":""},{"$nulls":15},{"$f":"填写信息!B175&\"\"","v":""}]
[{"$f":"填写信息!A176&\"\"","v":""},{"$nulls":9},{"$f":"IF(A83=\"\",\"\",填写信息!B$3)","v":""},{"$nulls":15},{"$f":"填写信息!B176&\"\"","v":""}]
[{"$f":"填写信息!A177&\"\"","v":""},{"$nulls":9},{"$f":"IF(A84=\"\",\"\",填写信息!B$3)","v":""},{"$nulls":15},{"$f":"填写信息!B177&\"\"","v":""}]
[{"$f":"填写信息!A178&\"\"","v":""},{"$nulls":9},{"$f":"IF(A85=\"\",\"\",填写信息!B$3)","v":""},{"$nulls":15},{"$f":"填写信息!B178&\"\"","v":""}]
[{"$f":"填写信息!A179&\"\"","v":""},{"$nulls":9},{"$f":"IF(A86=\"\",\"\",填写信息!B$3)","v":""},{"$nulls":15},{"$f":"填写信息!B179&\"\"","v":""}]
[{"$f":"填写信息!A180&\"\"","v":""},{"$nulls":9},{"$f":"IF(A87=\"\",\"\",填写信息!B$3)","v":""},{"$nulls":15},{"$f":"填写信息!B180&\"\"","v":""}]
[{"$f":"填写信息!A181&\"\"","v":""},{"$nulls":9},{"$f":"IF(A88=\"\",\"\",填写信息!B$3)","v":""},{"$nulls":15},{"$f":"填写信息!B181&\"\"","v":""}]
[{"$f":"填写信息!A182&\"\"","v":""},{"$nulls":9},{"$f":"IF(A89=\"\",\"\",填写信息!B$3)","v":""},{"$nulls":15},{"$f":"填写信息!B182&\"\"","v":""}]
[{"$f":"填写信息!A183&\"\"","v":""},{"$nulls":9},{"$f":"IF(A90=\"\",\"\",填写信息!B$3)","v":""},{"$nulls":15},{"$f":"填写信息!B183&\"\"","v":""}]
[{"$f":"填写信息!A184&\"\"","v":""},{"$nulls":9},{"$f":"IF(A91=\"\",\"\",填写信息!B$3)","v":""},{"$nulls":15},{"$f":"填写信息!B184&\"\"","v":""}]
[{"$f":"填写信息!A185&\"\"","v":""},{"$nulls":9},{"$f":"IF(A92=\"\",\"\",填写信息!B$3)","v":""},{"$nulls":15},{"$f":"填写信息!B185&\"\"","v":""}]
[{"$f":"填写信息!A186&\"\"","v":""},{"$nulls":9},{"$f":"IF(A93=\"\",\"\",填写信息!B$3)","v":""},{"$nulls":15},{"$f":"填写信息!B186&\"\"","v":""}]
[{"$f":"填写信息!A187&\"\"","v":""},{"$nulls":9},{"$f":"IF(A94=\"\",\"\",填写信息!B$3)","v":""},{"$nulls":15},{"$f":"填写信息!B187&\"\"","v":""}]
[{"$f":"填写信息!A188&\"\"","v":""},{"$nulls":9},{"$f":"IF(A95=\"\",\"\",填写信息!B$3)","v":""},{"$nulls":15},{"$f":"填写信息!B188&\"\"","v":""}]
[{"$f":"填写信息!A189&\"\"","v":""},{"$nulls":9},{"$f":"IF(A96=\"\",\"\",填写信息!B$3)","v":""},{"$nulls":15},{"$f":"填写信息!B189&\"\"","v":""}]
[{"$f":"填写信息!A190&\"\"","v":""},{"$nulls":9},{"$f":"IF(A97=\"\",\"\",填写信息!B$3)","v":""},{"$nulls":15},{"$f":"填写信息!B190&\"\"","v":""}]
[{"$f":"填写信息!A191&\"\"","v":""},{"$nulls":9},{"$f":"IF(A98=\"\",\"\",填写信息!B$3)","v":""},{"$nulls":15},{"$f":"填写信息!B191&\"\"","v":""}]
[{"$f":"填写信息!A192&\"\"","v":""},{"$nulls":9},{"$f":"IF(A99=\"\",\"\",填写信息!B$3)","v":""},{"$nulls":15},{"$f":"填写信息!B192&\"\"","v":""}]
[{"$f":"填写信息!A193&\"\"","v":""},{"$nulls":9},{"$f":"IF(A100=\"\",\"\",填写信息!B$3)","v":""},{"$nulls":15},{"$f":"填写信息!B193&\"\"","v":""}]
[{"$f":"填写信息!A194&\"\"","v":""},{"$nulls":9},{"$f":"IF(A101=\"\",\"\",填写信息!B$3)","v":""},{"$nulls":15},{"$f":"填写信息!B194&\"\"","v":""}]
[{"$f":"填写信息!A195&\"\"","v":""},{"$nulls":9},{"$f":"IF(A102=\"\",\"\",填写信息!B$3)","v":""},{"$nulls":15},{"$f":"填写信息!B195&\"\"","v":""}]
[{"$f":"填写信息!A196&\"\"","v":""},{"$nulls":9},{"$f":"IF(A103=\"\",\"\",填写信息!B$3)","v":""},{"$nulls":15},{"$f":"填写信息!B196&\"\"","v":""}]
[{"$f":"填写信息!A197&\"\"","v":""},{"$nulls":9},{"$f":"IF(A104=\"\",\"\",填写信息!B$3)","v":""},{"$nulls":15},{"$f":"填写信息!B197&\"\"","v":""}]

{"sheet":"舱单信息","index":5,"n_rows":150,"n_cols":19,"rows_kept":150,"cut":false,"hidden":false,"merged":[]}
[]
["新一票",{"$f":"填写信息!K3&\"[,]\"&填写信息!B6&\"[,]\"&填写信息!B7&\"[,]\"&填写信息!B8&\"[,]\"&填写信息!B9&\"[,]\"&填写信息!B10&\"[|]\"&填写信息!K10&\"[,]\"&填写信息!B14&\"[,]\"&填写信息!B15&\"[,]\"&填写信息!B16&\"[,]\"&填写信息!B17&\"[,]\"&填写信息!B18","v":"CN[,]BBBB有限公司[,]91440XXXXXXXXXXXXX[,]广东省湛江市xxx区xxx街道888号[,]1380975XXXX[,]SOMEBODY[|]GB[,]BBC CO.LTD[,]80808XXXXXXX[,]COUNTRY.STATE.CITY.DISTRICT.001[,]886-886-886[,]SOMEBODY"},{"$f":"填写信息!B23&\"[,]\"&填写信息!B22&\"[,]\"&填写信息!M22&\"\"","v":"ABCPORT[,]JAPAN[,]JP"},{"$f":"SUBSTITUTE(SUBSTITUTE(填写信息!J22,CHAR(10),\" \"),CHAR(9),\" \")","v":"测试货名1 [,](100[,]CTNS[,]18000KGS)[|]测试货名2 [,](100[,]PACKAGES[,]1200KGS)[|]测试货名3 [,](100[,]REEL[,]1200KGS)[|]测试货名4 [,](100[,]BAGS[,]1200KGS)[|]测试货名5 [,](100[,]BRAID[,]1200KGS)[|]测试货名6 [,](100[,]BAGS[,]1200KGS)[|]测试货名7 [,](100[,]BAGS[,]1200KGS)[|]测试货名8 [,](100[,]BAGS[,]1200KGS)[|]测试货名9 [,](100[,]BAGS[,]1200KGS)[|]测试货名10 [,](100[,]BAGS[,]1200KGS)[|]"},{"$f":"填写信息!B86&\"[,]\"&填写信息!B87&\"[,]\"&填写信息!E4","v":"[,][,]拖装"},{"$f":"填写信息!J23","v":1000},{"$f":"填写信息!J25","v":"件"},{"$f":"填写信息!J24","v":28800}," <--舱单数据由此提取",null,{"$f":"填写信息!B9","v":"1380975XXXX"},{"$f":"IF(MID($K2,1,1)=\" \",\"\",MID($K2,1,1))","v":"1"},{"$f":"IF(MID($K2,2,1)=\" \",\"\",MID($K2,2,1))","v":"3"},{"$f":"IF(MID($K2,3,1)=\" \",\"\",MID($K2,3,1))","v":"8"},{"$f":"IF(MID($K2,4,1)=\" \",\"\",MID($K2,4,1))","v":"0"},{"$f":"IF(MID($K2,5,1)=\" \",\"\",MID($K2,5,1))","v":"9"},{"$f":"IF(MID($K2,6,1)=\" \",\"\",MID($K2,6,1))","v":"7"},{"$f":"IF(MID($K2,7,1)=\" \",\"\",MID($K2,7,1))","v":"5"},{"$f":"MID($F2,8,1)","v":""}]
[{"$f":"IF(AND(B4=\"\",B3<>\"\"),\"结束\",IF(B3<>\"\",\"输入柜号\",\"\"))","v":"输入柜号"},{"$f":"IF(AND(填写信息!A96<>\"\",填写信息!A97=\"\"),填写信息!B$3,IF(填写信息!A97<>\"\",填写信息!B$3,\"\"))","v":"156000888887"},{"$f":"IF(填写信息!A97=\"\",\"\",SUBSTITUTE(SUBSTITUTE(填写信息!A97,\"'\",\"\"),\" \",\"\"))","v":"ABCD1234560"},null,{"$f":"IF(填写信息!A97=\"\",\"\",填写信息!B97&IF(OR(填写信息!D97=\"\",填写信息!D97=\"FCL\"),\"\",\"拼\"))","v":"EMCABC0001"},null,{"$f":"IF(填写信息!A97=\"\",\"\",填写信息!C97)","v":"40HQ"},null,"    请注意核对.",null,null,{"$f":"VALUE(L2)","v":1},{"$f":"VALUE(M2)","v":3},8,0,9,7,5]
[{"$f":"IF(AND(B5=\"\",B4<>\"\"),\"结束\",IF(B4<>\"\",\"输入柜号\",\"\"))","v":"结束"},{"$f":"IF(AND(填写信息!A97<>\"\",填写信息!A98=\"\"),填写信息!B$3,IF(填写信息!A98<>\"\",填写信息!B$3,\"\"))","v":"156000888887"},{"$f":"IF(填写信息!A98=\"\",\"\",SUBSTITUTE(SUBSTITUTE(填写信息!A98,\"'\",\"\"),\" \",\"\"))","v":""},null,{"$f":"IF(填写信息!A98=\"\",\"\",填写信息!B98&IF(OR(填写信息!D98=\"\",填写信息!D98=\"FCL\"),\"\",\"拼\"))","v":""},null,{"$f":"IF(填写信息!A98=\"\",\"\",填写信息!C98)","v":""},{"$nulls":4},{"$f":"IF(ISERROR(L3)=TRUE,\"\",L3)","v":1},{"$f":"IF(ISERROR(M3)=TRUE,\"\",M3)","v":3},8,0,9,7,5]
[{"$f":"IF(AND(B6=\"\",B5<>\"\"),\"结束\",IF(B5<>\"\",\"输入柜号\",\"\"))","v":""},{"$f":"IF(AND(填写信息!A98<>\"\",填写信息!A99=\"\"),填写信息!B$3,IF(填写信息!A99<>\"\",填写信息!B$3,\"\"))","v":""},{"$f":"IF(填写信息!A99=\"\",\"\",SUBSTITUTE(SUBSTITUTE(填写信息!A99,\"'\",\"\"),\" \",\"\"))","v":""},null,{"$f":"IF(填写信息!A99=\"\",\"\",填写信息!B99&IF(OR(填写信息!D99=\"\",填写信息!D99=\"FCL\"),\"\",\"拼\"))","v":""},null,{"$f":"IF(填写信息!A99=\"\",\"\",填写信息!C99)","v":""}]
["",{"$f":"IF(AND(填写信息!A99<>\"\",填写信息!A100=\"\"),填写信息!B$3,IF(填写信息!A100<>\"\",填写信息!B$3,\"\"))","v":""},{"$f":"IF(填写信息!A100=\"\",\"\",SUBSTITUTE(SUBSTITUTE(填写信息!A100,\"'\",\"\"),\" \",\"\"))","v":""},null,{"$f":"IF(填写信息!A100=\"\",\"\",填写信息!B100&IF(OR(填写信息!D100=\"\",填写信息!D100=\"FCL\"),\"\",\"拼\"))","v":""},null,{"$f":"IF(填写信息!A100=\"\",\"\",填写信息!C100)","v":""}]
["",{"$f":"IF(AND(填写信息!A100<>\"\",填写信息!A101=\"\"),填写信息!B$3,IF(填写信息!A101<>\"\",填写信息!B$3,\"\"))","v":""},{"$f":"IF(填写信息!A101=\"\",\"\",SUBSTITUTE(SUBSTITUTE(填写信息!A101,\"'\",\"\"),\" \",\"\"))","v":""},null,{"$f":"IF(填写信息!A101=\"\",\"\",填写信息!B101&IF(OR(填写信息!D101=\"\",填写信息!D101=\"FCL\"),\"\",\"拼\"))","v":""},null,{"$f":"IF(填写信息!A101=\"\",\"\",填写信息!C101)","v":""}]
["",{"$f":"IF(AND(填写信息!A101<>\"\",填写信息!A102=\"\"),填写信息!B$3,IF(填写信息!A102<>\"\",填写信息!B$3,\"\"))","v":""},{"$f":"IF(填写信息!A102=\"\",\"\",SUBSTITUTE(SUBSTITUTE(填写信息!A102,\"'\",\"\"),\" \",\"\"))","v":""},null,{"$f":"IF(填写信息!A102=\"\",\"\",填写信息!B102&IF(OR(填写信息!D102=\"\",填写信息!D102=\"FCL\"),\"\",\"拼\"))","v":""},null,{"$f":"IF(填写信息!A102=\"\",\"\",填写信息!C102)","v":""}]
["",{"$f":"IF(AND(填写信息!A102<>\"\",填写信息!A103=\"\"),填写信息!B$3,IF(填写信息!A103<>\"\",填写信息!B$3,\"\"))","v":""},{"$f":"IF(填写信息!A103=\"\",\"\",SUBSTITUTE(SUBSTITUTE(填写信息!A103,\"'\",\"\"),\" \",\"\"))","v":""},null,{"$f":"IF(填写信息!A103=\"\",\"\",填写信息!B103&IF(OR(填写信息!D103=\"\",填写信息!D103=\"FCL\"),\"\",\"拼\"))","v":""},null,{"$f":"IF(填写信息!A103=\"\",\"\",填写信息!C103)","v":""}]
["",{"$f":"IF(AND(填写信息!A103<>\"\",填写信息!A104=\"\"),填写信息!B$3,IF(填写信息!A104<>\"\",填写信息!B$3,\"\"))","v":""},{"$f":"IF(填写信息!A104=\"\",\"\",SUBSTITUTE(SUBSTITUTE(填写信息!A104,\"'\",\"\"),\" \",\"\"))","v":""},null,{"$f":"IF(填写信息!A104=\"\",\"\",填写信息!B104&IF(OR(填写信息!D104=\"\",填写信息!D104=\"FCL\"),\"\",\"拼\"))","v":""},null,{"$f":"IF(填写信息!A104=\"\",\"\",填写信息!C104)","v":""},null,null,{"$f":"填写信息!B20","v":"UNI-ACCORD"}]
["",{"$f":"IF(AND(填写信息!A104<>\"\",填写信息!A105=\"\"),填写信息!B$3,IF(填写信息!A105<>\"\",填写信息!B$3,\"\"))","v":""},{"$f":"IF(填写信息!A105=\"\",\"\",SUBSTITUTE(SUBSTITUTE(填写信息!A105,\"'\",\"\"),\" \",\"\"))","v":""},null,{"$f":"IF(填写信息!A105=\"\",\"\",填写信息!B105&IF(OR(填写信息!D105=\"\",填写信息!D105=\"FCL\"),\"\",\"拼\"))","v":""},null,{"$f":"IF(填写信息!A105=\"\",\"\",填写信息!C105)","v":""},null,null,{"$f":"填写信息!B21","v":"0274519B"}]
["",{"$f":"IF(AND(填写信息!A105<>\"\",填写信息!A106=\"\"),填写信息!B$3,IF(填写信息!A106<>\"\",填写信息!B$3,\"\"))","v":""},{"$f":"IF(填写信息!A106=\"\",\"\",SUBSTITUTE(SUBSTITUTE(填写信息!A106,\"'\",\"\"),\" \",\"\"))","v":""},null,{"$f":"IF(填写信息!A106=\"\",\"\",填写信息!B106&IF(OR(填写信息!D106=\"\",填写信息!D106=\"FCL\"),\"\",\"拼\"))","v":""},null,{"$f":"IF(填写信息!A106=\"\",\"\",填写信息!C106)","v":""}]
["",{"$f":"IF(AND(填写信息!A106<>\"\",填写信息!A107=\"\"),填写信息!B$3,IF(填写信息!A107<>\"\",填写信息!B$3,\"\"))","v":""},{"$f":"IF(填写信息!A107=\"\",\"\",SUBSTITUTE(SUBSTITUTE(填写信息!A107,\"'\",\"\"),\" \",\"\"))","v":""},null,{"$f":"IF(填写信息!A107=\"\",\"\",填写信息!B107&IF(OR(填写信息!D107=\"\",填写信息!D107=\"FCL\"),\"\",\"拼\"))","v":""},null,{"$f":"IF(填写信息!A107=\"\",\"\",填写信息!C107)","v":""}]
["",{"$f":"IF(AND(填写信息!A107<>\"\",填写信息!A108=\"\"),填写信息!B$3,IF(填写信息!A108<>\"\",填写信息!B$3,\"\"))","v":""},{"$f":"IF(填写信息!A108=\"\",\"\",SUBSTITUTE(SUBSTITUTE(填写信息!A108,\"'\",\"\"),\" \",\"\"))","v":""},null,{"$f":"IF(填写信息!A108=\"\",\"\",填写信息!B108&IF(OR(填写信息!D108=\"\",填写信息!D108=\"FCL\"),\"\",\"拼\"))","v":""},null,{"$f":"IF(填写信息!A108=\"\",\"\",填写信息!C108)","v":""}]
["",{"$f":"IF(AND(填写信息!A108<>\"\",填写信息!A109=\"\"),填写信息!B$3,IF(填写信息!A109<>\"\",填写信息!B$3,\"\"))","v":""},{"$f":"IF(填写信息!A109=\"\",\"\",SUBSTITUTE(SUBSTITUTE(填写信息!A109,\"'\",\"\"),\" \",\"\"))","v":""},null,{"$f":"IF(填写信息!A109=\"\",\"\",填写信息!B109&IF(OR(填写信息!D109=\"\",填写信息!D109=\"FCL\"),\"\",\"拼\"))","v":""},null,{"$f":"IF(填写信息!A109=\"\",\"\",填写信息!C109)","v":""}]
["",{"$f":"IF(AND(填写信息!A109<>\"\",填写信息!A110=\"\"),填写信息!B$3,IF(填写信息!A110<>\"\",填写信息!B$3,\"\"))","v":""},{"$f":"IF(填写信息!A110=\"\",\"\",SUBSTITUTE(SUBSTITUTE(填写信息!A110,\"'\",\"\"),\" \",\"\"))","v":""},null,{"$f":"IF(填写信息!A110=\"\",\"\",填写信息!B110&IF(OR(填写信息!D110=\"\",填写信息!D110=\"FCL\"),\"\",\"拼\"))","v":""},null,{"$f":"IF(填写信息!A110=\"\",\"\",填写信息!C110)","v":""}]
["",{"$f":"IF(AND(填写信息!A110<>\"\",填写信息!A111=\"\"),填写信息!B$3,IF(填写信息!A111<>\"\",填写信息!B$3,\"\"))","v":""},{"$f":"IF(填写信息!A111=\"\",\"\",SUBSTITUTE(SUBSTITUTE(填写信息!A111,\"'\",\"\"),\" \",\"\"))","v":""},null,{"$f":"IF(填写信息!A111=\"\",\"\",填写信息!B111&IF(OR(填写信息!D111=\"\",填写信息!D111=\"FCL\"),\"\",\"拼\"))","v":""},null,{"$f":"IF(填写信息!A111=\"\",\"\",填写信息!C111)","v":""}]
["",{"$f":"IF(AND(填写信息!A111<>\"\",填写信息!A112=\"\"),填写信息!B$3,IF(填写信息!A112<>\"\",填写信息!B$3,\"\"))","v":""},{"$f":"IF(填写信息!A112=\"\",\"\",SUBSTITUTE(SUBSTITUTE(填写信息!A112,\"'\",\"\"),\" \",\"\"))","v":""},null,{"$f":"IF(填写信息!A112=\"\",\"\",填写信息!B112&IF(OR(填写信息!D112=\"\",填写信息!D112=\"FCL\"),\"\",\"拼\"))","v":""},null,{"$f":"IF(填写信息!A112=\"\",\"\",填写信息!C112)","v":""}]
["",{"$f":"IF(AND(填写信息!A112<>\"\",填写信息!A113=\"\"),填写信息!B$3,IF(填写信息!A113<>\"\",填写信息!B$3,\"\"))","v":""},{"$f":"IF(填写信息!A113=\"\",\"\",SUBSTITUTE(SUBSTITUTE(填写信息!A113,\"'\",\"\"),\" \",\"\"))","v":""},null,{"$f":"IF(填写信息!A113=\"\",\"\",填写信息!B113&IF(OR(填写信息!D113=\"\",填写信息!D113=\"FCL\"),\"\",\"拼\"))","v":""},null,{"$f":"IF(填写信息!A113=\"\",\"\",填写信息!C113)","v":""}]
["",{"$f":"IF(AND(填写信息!A113<>\"\",填写信息!A114=\"\"),填写信息!B$3,IF(填写信息!A114<>\"\",填写信息!B$3,\"\"))","v":""},{"$f":"IF(填写信息!A114=\"\",\"\",SUBSTITUTE(SUBSTITUTE(填写信息!A114,\"'\",\"\"),\" \",\"\"))","v":""},null,{"$f":"IF(填写信息!A114=\"\",\"\",填写信息!B114&IF(OR(填写信息!D114=\"\",填写信息!D114=\"FCL\"),\"\",\"拼\"))","v":""},null,{"$f":"IF(填写信息!A114=\"\",\"\",填写信息!C114)","v":""}]
["",{"$f":"IF(AND(填写信息!A114<>\"\",填写信息!A115=\"\"),填写信息!B$3,IF(填写信息!A115<>\"\",填写信息!B$3,\"\"))","v":""},{"$f":"IF(填写信息!A115=\"\",\"\",SUBSTITUTE(SUBSTITUTE(填写信息!A115,\"'\",\"\"),\" \",\"\"))","v":""},null,{"$f":"IF(填写信息!A115=\"\",\"\",填写信息!B115&IF(OR(填写信息!D115=\"\",填写信息!D115=\"FCL\"),\"\",\"拼\"))","v":""},null,{"$f":"IF(填写信息!A115=\"\",\"\",填写信息!C115)","v":""}]
["",{"$f":"IF(AND(填写信息!A115<>\"\",填写信息!A116=\"\"),填写信息!B$3,IF(填写信息!A116<>\"\",填写信息!B$3,\"\"))","v":""},{"$f":"IF(填写信息!A116=\"\",\"\",SUBSTITUTE(SUBSTITUTE(填写信息!A116,\"'\",\"\"),\" \",\"\"))","v":""},null,{"$f":"IF(填写信息!A116=\"\",\"\",填写信息!B116&IF(OR(填写信息!D116=\"\",填写信息!D116=\"FCL\"),\"\",\"拼\"))","v":""},null,{"$f":"IF(填写信息!A116=\"\",\"\",填写信息!C116)","v":""}]
["",{"$f":"IF(AND(填写信息!A116<>\"\",填写信息!A117=\"\"),填写信息!B$3,IF(填写信息!A117<>\"\",填写信息!B$3,\"\"))","v":""},{"$f":"IF(填写信息!A117=\"\",\"\",SUBSTITUTE(SUBSTITUTE(填写信息!A117,\"'\",\"\"),\" \",\"\"))","v":""},null,{"$f":"IF(填写信息!A117=\"\",\"\",填写信息!B117&IF(OR(填写信息!D117=\"\",填写信息!D117=\"FCL\"),\"\",\"拼\"))","v":""},null,{"$f":"IF(填写信息!A117=\"\",\"\",填写信息!C117)","v":""}]
["",{"$f":"IF(AND(填写信息!A117<>\"\",填写信息!A118=\"\"),填写信息!B$3,IF(填写信息!A118<>\"\",填写信息!B$3,\"\"))","v":""},{"$f":"IF(填写信息!A118=\"\",\"\",SUBSTITUTE(SUBSTITUTE(填写信息!A118,\"'\",\"\"),\" \",\"\"))","v":""},null,{"$f":"IF(填写信息!A118=\"\",\"\",填写信息!B118&IF(OR(填写信息!D118=\"\",填写信息!D118=\"FCL\"),\"\",\"拼\"))","v":""},null,{"$f":"IF(填写信息!A118=\"\",\"\",填写信息!C118)","v":""}]
["",{"$f":"IF(AND(填写信息!A118<>\"\",填写信息!A119=\"\"),填写信息!B$3,IF(填写信息!A119<>\"\",填写信息!B$3,\"\"))","v":""},{"$f":"IF(填写信息!A119=\"\",\"\",SUBSTITUTE(SUBSTITUTE(填写信息!A119,\"'\",\"\"),\" \",\"\"))","v":""},null,{"$f":"IF(填写信息!A119=\"\",\"\",填写信息!B119&IF(OR(填写信息!D119=\"\",填写信息!D119=\"FCL\"),\"\",\"拼\"))","v":""},null,{"$f":"IF(填写信息!A119=\"\",\"\",填写信息!C119)","v":""}]
["",{"$f":"IF(AND(填写信息!A119<>\"\",填写信息!A120=\"\"),填写信息!B$3,IF(填写信息!A120<>\"\",填写信息!B$3,\"\"))","v":""},{"$f":"IF(填写信息!A120=\"\",\"\",SUBSTITUTE(SUBSTITUTE(填写信息!A120,\"'\",\"\"),\" \",\"\"))","v":""},null,{"$f":"IF(填写信息!A120=\"\",\"\",填写信息!B120&IF(OR(填写信息!D120=\"\",填写信息!D120=\"FCL\"),\"\",\"拼\"))","v":""},null,{"$f":"IF(填写信息!A120=\"\",\"\",填写信息!C120)","v":""}]
["",{"$f":"IF(AND(填写信息!A120<>\"\",填写信息!A121=\"\"),填写信息!B$3,IF(填写信息!A121<>\"\",填写信息!B$3,\"\"))","v":""},{"$f":"IF(填写信息!A121=\"\",\"\",SUBSTITUTE(SUBSTITUTE(填写信息!A121,\"'\",\"\"),\" \",\"\"))","v":""},null,{"$f":"IF(填写信息!A121=\"\",\"\",填写信息!B121&IF(OR(填写信息!D121=\"\",填写信息!D121=\"FCL\"),\"\",\"拼\"))","v":""},null,{"$f":"IF(填写信息!A121=\"\",\"\",填写信息!C121)","v":""}]
["",{"$f":"IF(AND(填写信息!A121<>\"\",填写信息!A122=\"\"),填写信息!B$3,IF(填写信息!A122<>\"\",填写信息!B$3,\"\"))","v":""},{"$f":"IF(填写信息!A122=\"\",\"\",SUBSTITUTE(SUBSTITUTE(填写信息!A122,\"'\",\"\"),\" \",\"\"))","v":""},null,{"$f":"IF(填写信息!A122=\"\",\"\",填写信息!B122&IF(OR(填写信息!D122=\"\",填写信息!D122=\"FCL\"),\"\",\"拼\"))","v":""},null,{"$f":"IF(填写信息!A122=\"\",\"\",填写信息!C122)","v":""}]
["",{"$f":"IF(AND(填写信息!A122<>\"\",填写信息!A123=\"\"),填写信息!B$3,IF(填写信息!A123<>\"\",填写信息!B$3,\"\"))","v":""},{"$f":"IF(填写信息!A123=\"\",\"\",SUBSTITUTE(SUBSTITUTE(填写信息!A123,\"'\",\"\"),\" \",\"\"))","v":""},null,{"$f":"IF(填写信息!A123=\"\",\"\",填写信息!B123&IF(OR(填写信息!D123=\"\",填写信息!D123=\"FCL\"),\"\",\"拼\"))","v":""},null,{"$f":"IF(填写信息!A123=\"\",\"\",填写信息!C123)","v":""}]
["",{"$f":"IF(AND(填写信息!A123<>\"\",填写信息!A124=\"\"),填写信息!B$3,IF(填写信息!A124<>\"\",填写信息!B$3,\"\"))","v":""},{"$f":"IF(填写信息!A124=\"\",\"\",SUBSTITUTE(SUBSTITUTE(填写信息!A124,\"'\",\"\"),\" \",\"\"))","v":""},null,{"$f":"IF(填写信息!A124=\"\",\"\",填写信息!B124&IF(OR(填写信息!D124=\"\",填写信息!D124=\"FCL\"),\"\",\"拼\"))","v":""},null,{"$f":"IF(填写信息!A124=\"\",\"\",填写信息!C124)","v":""}]
["",{"$f":"IF(AND(填写信息!A124<>\"\",填写信息!A125=\"\"),填写信息!B$3,IF(填写信息!A125<>\"\",填写信息!B$3,\"\"))","v":""},{"$f":"IF(填写信息!A125=\"\",\"\",SUBSTITUTE(SUBSTITUTE(填写信息!A125,\"'\",\"\"),\" \",\"\"))","v":""},null,{"$f":"IF(填写信息!A125=\"\",\"\",填写信息!B125&IF(OR(填写信息!D125=\"\",填写信息!D125=\"FCL\"),\"\",\"拼\"))","v":""},null,{"$f":"IF(填写信息!A125=\"\",\"\",填写信息!C125)","v":""}]
["",{"$f":"IF(AND(填写信息!A125<>\"\",填写信息!A126=\"\"),填写信息!B$3,IF(填写信息!A126<>\"\",填写信息!B$3,\"\"))","v":""},{"$f":"IF(填写信息!A126=\"\",\"\",SUBSTITUTE(SUBSTITUTE(填写信息!A126,\"'\",\"\"),\" \",\"\"))","v":""},null,{"$f":"IF(填写信息!A126=\"\",\"\",填写信息!B126&IF(OR(填写信息!D126=\"\",填写信息!D126=\"FCL\"),\"\",\"拼\"))","v":""},null,{"$f":"IF(填写信息!A126=\"\",\"\",填写信息!C126)","v":""}]
["",{"$f":"IF(AND(填写信息!A126<>\"\",填写信息!A127=\"\"),填写信息!B$3,IF(填写信息!A127<>\"\",填写信息!B$3,\"\"))","v":""},{"$f":"IF(填写信息!A127=\"\",\"\",SUBSTITUTE(SUBSTITUTE(填写信息!A127,\"'\",\"\"),\" \",\"\"))","v":""},null,{"$f":"IF(填写信息!A127=\"\",\"\",填写信息!B127&IF(OR(填写信息!D127=\"\",填写信息!D127=\"FCL\"),\"\",\"拼\"))","v":""},null,{"$f":"IF(填写信息!A127=\"\",\"\",填写信息!C127)","v":""}]
["",{"$f":"IF(AND(填写信息!A127<>\"\",填写信息!A128=\"\"),填写信息!B$3,IF(填写信息!A128<>\"\",填写信息!B$3,\"\"))","v":""},{"$f":"IF(填写信息!A128=\"\",\"\",SUBSTITUTE(SUBSTITUTE(填写信息!A128,\"'\",\"\"),\" \",\"\"))","v":""},null,{"$f":"IF(填写信息!A128=\"\",\"\",填写信息!B128&IF(OR(填写信息!D128=\"\",填写信息!D128=\"FCL\"),\"\",\"拼\"))","v":""},null,{"$f":"IF(填写信息!A128=\"\",\"\",填写信息!C128)","v":""}]
["",{"$f":"IF(AND(填写信息!A128<>\"\",填写信息!A129=\"\"),填写信息!B$3,IF(填写信息!A129<>\"\",填写信息!B$3,\"\"))","v":""},{"$f":"IF(填写信息!A129=\"\",\"\",SUBSTITUTE(SUBSTITUTE(填写信息!A129,\"'\",\"\"),\" \",\"\"))","v":""},null,{"$f":"IF(填写信息!A129=\"\",\"\",填写信息!B129&IF(OR(填写信息!D129=\"\",填写信息!D129=\"FCL\"),\"\",\"拼\"))","v":""},null,{"$f":"IF(填写信息!A129=\"\",\"\",填写信息!C129)","v":""}]
["",{"$f":"IF(AND(填写信息!A129<>\"\",填写信息!A130=\"\"),填写信息!B$3,IF(填写信息!A130<>\"\",填写信息!B$3,\"\"))","v":""},{"$f":"IF(填写信息!A130=\"\",\"\",SUBSTITUTE(SUBSTITUTE(填写信息!A130,\"'\",\"\"),\" \",\"\"))","v":""},null,{"$f":"IF(填写信息!A130=\"\",\"\",填写信息!B130&IF(OR(填写信息!D130=\"\",填写信息!D130=\"FCL\"),\"\",\"拼\"))","v":""},null,{"$f":"IF(填写信息!A130=\"\",\"\",填写信息!C130)","v":""}]
["",{"$f":"IF(AND(填写信息!A130<>\"\",填写信息!A131=\"\"),填写信息!B$3,IF(填写信息!A131<>\"\",填写信息!B$3,\"\"))","v":""},{"$f":"IF(填写信息!A131=\"\",\"\",SUBSTITUTE(SUBSTITUTE(填写信息!A131,\"'\",\"\"),\" \",\"\"))","v":""},null,{"$f":"IF(填写信息!A131=\"\",\"\",填写信息!B131&IF(OR(填写信息!D131=\"\",填写信息!D131=\"FCL\"),\"\",\"拼\"))","v":""},null,{"$f":"IF(填写信息!A131=\"\",\"\",填写信息!C131)","v":""}]
["",{"$f":"IF(AND(填写信息!A131<>\"\",填写信息!A132=\"\"),填写信息!B$3,IF(填写信息!A132<>\"\",填写信息!B$3,\"\"))","v":""},{"$f":"IF(填写信息!A132=\"\",\"\",SUBSTITUTE(SUBSTITUTE(填写信息!A132,\"'\",\"\"),\" \",\"\"))","v":""},null,{"$f":"IF(填写信息!A132=\"\",\"\",填写信息!B132&IF(OR(填写信息!D132=\"\",填写信息!D132=\"FCL\"),\"\",\"拼\"))","v":""},null,{"$f":"IF(填写信息!A132=\"\",\"\",填写信息!C132)","v":""}]
["",{"$f":"IF(AND(填写信息!A132<>\"\",填写信息!A133=\"\"),填写信息!B$3,IF(填写信息!A133<>\"\",填写信息!B$3,\"\"))","v":""},{"$f":"IF(填写信息!A133=\"\",\"\",SUBSTITUTE(SUBSTITUTE(填写信息!A133,\"'\",\"\"),\" \",\"\"))","v":""},null,{"$f":"IF(填写信息!A133=\"\",\"\",填写信息!B133&IF(OR(填写信息!D133=\"\",填写信息!D133=\"FCL\"),\"\",\"拼\"))","v":""},null,{"$f":"IF(填写信息!A133=\"\",\"\",填写信息!C133)","v":""}]
["",{"$f":"IF(AND(填写信息!A133<>\"\",填写信息!A134=\"\"),填写信息!B$3,IF(填写信息!A134<>\"\",填写信息!B$3,\"\"))","v":""},{"$f":"IF(填写信息!A134=\"\",\"\",SUBSTITUTE(SUBSTITUTE(填写信息!A134,\"'\",\"\"),\" \",\"\"))","v":""},null,{"$f":"IF(填写信息!A134=\"\",\"\",填写信息!B134&IF(OR(填写信息!D134=\"\",填写信息!D134=\"FCL\"),\"\",\"拼\"))","v":""},null,{"$f":"IF(填写信息!A134=\"\",\"\",填写信息!C134)","v":""}]
["",{"$f":"IF(AND(填写信息!A134<>\"\",填写信息!A135=\"\"),填写信息!B$3,IF(填写信息!A135<>\"\",填写信息!B$3,\"\"))","v":""},{"$f":"IF(填写信息!A135=\"\",\"\",SUBSTITUTE(SUBSTITUTE(填写信息!A135,\"'\",\"\"),\" \",\"\"))","v":""},null,{"$f":"IF(填写信息!A135=\"\",\"\",填写信息!B135&IF(OR(填写信息!D135=\"\",填写信息!D135=\"FCL\"),\"\",\"拼\"))","v":""},null,{"$f":"IF(填写信息!A135=\"\",\"\",填写信息!C135)","v":""}]
["",{"$f":"IF(AND(填写信息!A135<>\"\",填写信息!A136=\"\"),填写信息!B$3,IF(填写信息!A136<>\"\",填写信息!B$3,\"\"))","v":""},{"$f":"IF(填写信息!A136=\"\",\"\",SUBSTITUTE(SUBSTITUTE(填写信息!A136,\"'\",\"\"),\" \",\"\"))","v":""},null,{"$f":"IF(填写信息!A136=\"\",\"\",填写信息!B136&IF(OR(填写信息!D136=\"\",填写信息!D136=\"FCL\"),\"\",\"拼\"))","v":""},null,{"$f":"IF(填写信息!A136=\"\",\"\",填写信息!C136)","v":""}]
["",{"$f":"IF(AND(填写信息!A136<>\"\",填写信息!A137=\"\"),填写信息!B$3,IF(填写信息!A137<>\"\",填写信息!B$3,\"\"))","v":""},{"$f":"IF(填写信息!A137=\"\",\"\",SUBSTITUTE(SUBSTITUTE(填写信息!A137,\"'\",\"\"),\" \",\"\"))","v":""},null,{"$f":"IF(填写信息!A137=\"\",\"\",填写信息!B137&IF(OR(填写信息!D137=\"\",填写信息!D137=\"FCL\"),\"\",\"拼\"))","v":""},null,{"$f":"IF(填写信息!A137=\"\",\"\",填写信息!C137)","v":""}]
["",{"$f":"IF(AND(填写信息!A137<>\"\",填写信息!A138=\"\"),填写信息!B$3,IF(填写信息!A138<>\"\",填写信息!B$3,\"\"))","v":""},{"$f":"IF(填写信息!A138=\"\",\"\",SUBSTITUTE(SUBSTITUTE(填写信息!A138,\"'\",\"\"),\" \",\"\"))","v":""},null,{"$f":"IF(填写信息!A138=\"\",\"\",填写信息!B138&IF(OR(填写信息!D138=\"\",填写信息!D138=\"FCL\"),\"\",\"拼\"))","v":""},null,{"$f":"IF(填写信息!A138=\"\",\"\",填写信息!C138)","v":""}]
["",{"$f":"IF(AND(填写信息!A138<>\"\",填写信息!A139=\"\"),填写信息!B$3,IF(填写信息!A139<>\"\",填写信息!B$3,\"\"))","v":""},{"$f":"IF(填写信息!A139=\"\",\"\",SUBSTITUTE(SUBSTITUTE(填写信息!A139,\"'\",\"\"),\" \",\"\"))","v":""},null,{"$f":"IF(填写信息!A139=\"\",\"\",填写信息!B139&IF(OR(填写信息!D139=\"\",填写信息!D139=\"FCL\"),\"\",\"拼\"))","v":""},null,{"$f":"IF(填写信息!A139=\"\",\"\",填写信息!C139)","v":""}]
["",{"$f":"IF(AND(填写信息!A139<>\"\",填写信息!A140=\"\"),填写信息!B$3,IF(填写信息!A140<>\"\",填写信息!B$3,\"\"))","v":""},{"$f":"IF(填写信息!A140=\"\",\"\",SUBSTITUTE(SUBSTITUTE(填写信息!A140,\"'\",\"\"),\" \",\"\"))","v":""},null,{"$f":"IF(填写信息!A140=\"\",\"\",填写信息!B140&IF(OR(填写信息!D140=\"\",填写信息!D140=\"FCL\"),\"\",\"拼\"))","v":""},null,{"$f":"IF(填写信息!A140=\"\",\"\",填写信息!C140)","v":""}]
["",{"$f":"IF(AND(填写信息!A140<>\"\",填写信息!A141=\"\"),填写信息!B$3,IF(填写信息!A141<>\"\",填写信息!B$3,\"\"))","v":""},{"$f":"IF(填写信息!A141=\"\",\"\",SUBSTITUTE(SUBSTITUTE(填写信息!A141,\"'\",\"\"),\" \",\"\"))","v":""},null,{"$f":"IF(填写信息!A141=\"\",\"\",填写信息!B141&IF(OR(填写信息!D141=\"\",填写信息!D141=\"FCL\"),\"\",\"拼\"))","v":""},null,{"$f":"IF(填写信息!A141=\"\",\"\",填写信息!C141)","v":""}]
["",{"$f":"IF(AND(填写信息!A141<>\"\",填写信息!A142=\"\"),填写信息!B$3,IF(填写信息!A142<>\"\",填写信息!B$3,\"\"))","v":""},{"$f":"IF(填写信息!A142=\"\",\"\",SUBSTITUTE(SUBSTITUTE(填写信息!A142,\"'\",\"\"),\" \",\"\"))","v":""},null,{"$f":"IF(填写信息!A142=\"\",\"\",填写信息!B142&IF(OR(填写信息!D142=\"\",填写信息!D142=\"FCL\"),\"\",\"拼\"))","v":""},null,{"$f":"IF(填写信息!A142=\"\",\"\",填写信息!C142)","v":""}]
["",{"$f":"IF(AND(填写信息!A142<>\"\",填写信息!A143=\"\"),填写信息!B$3,IF(填写信息!A143<>\"\",填写信息!B$3,\"\"))","v":""},{"$f":"IF(填写信息!A143=\"\",\"\",SUBSTITUTE(SUBSTITUTE(填写信息!A143,\"'\",\"\"),\" \",\"\"))","v":""},null,{"$f":"IF(填写信息!A143=\"\",\"\",填写信息!B143&IF(OR(填写信息!D143=\"\",填写信息!D143=\"FCL\"),\"\",\"拼\"))","v":""},null,{"$f":"IF(填写信息!A143=\"\",\"\",填写信息!C143)","v":""}]
["",{"$f":"IF(AND(填写信息!A143<>\"\",填写信息!A144=\"\"),填写信息!B$3,IF(填写信息!A144<>\"\",填写信息!B$3,\"\"))","v":""},{"$f":"IF(填写信息!A144=\"\",\"\",SUBSTITUTE(SUBSTITUTE(填写信息!A144,\"'\",\"\"),\" \",\"\"))","v":""},null,{"$f":"IF(填写信息!A144=\"\",\"\",填写信息!B144&IF(OR(填写信息!D144=\"\",填写信息!D144=\"FCL\"),\"\",\"拼\"))","v":""},null,{"$f":"IF(填写信息!A144=\"\",\"\",填写信息!C144)","v":""}]
["",{"$f":"IF(AND(填写信息!A144<>\"\",填写信息!A145=\"\"),填写信息!B$3,IF(填写信息!A145<>\"\",填写信息!B$3,\"\"))","v":""},{"$f":"IF(填写信息!A145=\"\",\"\",SUBSTITUTE(SUBSTITUTE(填写信息!A145,\"'\",\"\"),\" \",\"\"))","v":""},null,{"$f":"IF(填写信息!A145=\"\",\"\",填写信息!B145&IF(OR(填写信息!D145=\"\",填写信息!D145=\"FCL\"),\"\",\"拼\"))","v":""},null,{"$f":"IF(填写信息!A145=\"\",\"\",填写信息!C145)","v":""}]
["",{"$f":"IF(AND(填写信息!A145<>\"\",填写信息!A146=\"\"),填写信息!B$3,IF(填写信息!A146<>\"\",填写信息!B$3,\"\"))","v":""},{"$f":"IF(填写信息!A146=\"\",\"\",SUBSTITUTE(SUBSTITUTE(填写信息!A146,\"'\",\"\"),\" \",\"\"))","v":""},null,{"$f":"IF(填写信息!A146=\"\",\"\",填写信息!B146&IF(OR(填写信息!D146=\"\",填写信息!D146=\"FCL\"),\"\",\"拼\"))","v":""},null,{"$f":"IF(填写信息!A146=\"\",\"\",填写信息!C146)","v":""}]
["",{"$f":"IF(AND(填写信息!A146<>\"\",填写信息!A147=\"\"),填写信息!B$3,IF(填写信息!A147<>\"\",填写信息!B$3,\"\"))","v":""},{"$f":"IF(填写信息!A147=\"\",\"\",SUBSTITUTE(SUBSTITUTE(填写信息!A147,\"'\",\"\"),\" \",\"\"))","v":""},null,{"$f":"IF(填写信息!A147=\"\",\"\",填写信息!B147&IF(OR(填写信息!D147=\"\",填写信息!D147=\"FCL\"),\"\",\"拼\"))","v":""},null,{"$f":"IF(填写信息!A147=\"\",\"\",填写信息!C147)","v":""}]
["",{"$f":"IF(AND(填写信息!A147<>\"\",填写信息!A148=\"\"),填写信息!B$3,IF(填写信息!A148<>\"\",填写信息!B$3,\"\"))","v":""},{"$f":"IF(填写信息!A148=\"\",\"\",SUBSTITUTE(SUBSTITUTE(填写信息!A148,\"'\",\"\"),\" \",\"\"))","v":""},null,{"$f":"IF(填写信息!A148=\"\",\"\",填写信息!B148&IF(OR(填写信息!D148=\"\",填写信息!D148=\"FCL\"),\"\",\"拼\"))","v":""},null,{"$f":"IF(填写信息!A148=\"\",\"\",填写信息!C148)","v":""}]
["",{"$f":"IF(AND(填写信息!A148<>\"\",填写信息!A149=\"\"),填写信息!B$3,IF(填写信息!A149<>\"\",填写信息!B$3,\"\"))","v":""},{"$f":"IF(填写信息!A149=\"\",\"\",SUBSTITUTE(SUBSTITUTE(填写信息!A149,\"'\",\"\"),\" \",\"\"))","v":""},null,{"$f":"IF(填写信息!A149=\"\",\"\",填写信息!B149&IF(OR(填写信息!D149=\"\",填写信息!D149=\"FCL\"),\"\",\"拼\"))","v":""},null,{"$f":"IF(填写信息!A149=\"\",\"\",填写信息!C149)","v":""}]
["",{"$f":"IF(AND(填写信息!A149<>\"\",填写信息!A150=\"\"),填写信息!B$3,IF(填写信息!A150<>\"\",填写信息!B$3,\"\"))","v":""},{"$f":"IF(填写信息!A150=\"\",\"\",SUBSTITUTE(SUBSTITUTE(填写信息!A150,\"'\",\"\"),\" \",\"\"))","v":""},null,{"$f":"IF(填写信息!A150=\"\",\"\",填写信息!B150&IF(OR(填写信息!D150=\"\",填写信息!D150=\"FCL\"),\"\",\"拼\"))","v":""},null,{"$f":"IF(填写信息!A150=\"\",\"\",填写信息!C150)","v":""}]
["",{"$f":"IF(AND(填写信息!A150<>\"\",填写信息!A151=\"\"),填写信息!B$3,IF(填写信息!A151<>\"\",填写信息!B$3,\"\"))","v":""},{"$f":"IF(填写信息!A151=\"\",\"\",SUBSTITUTE(SUBSTITUTE(填写信息!A151,\"'\",\"\"),\" \",\"\"))","v":""},null,{"$f":"IF(填写信息!A151=\"\",\"\",填写信息!B151&IF(OR(填写信息!D151=\"\",填写信息!D151=\"FCL\"),\"\",\"拼\"))","v":""},null,{"$f":"IF(填写信息!A151=\"\",\"\",填写信息!C151)","v":""}]
["",{"$f":"IF(AND(填写信息!A151<>\"\",填写信息!A152=\"\"),填写信息!B$3,IF(填写信息!A152<>\"\",填写信息!B$3,\"\"))","v":""},{"$f":"IF(填写信息!A152=\"\",\"\",SUBSTITUTE(SUBSTITUTE(填写信息!A152,\"'\",\"\"),\" \",\"\"))","v":""},null,{"$f":"IF(填写信息!A152=\"\",\"\",填写信息!B152&IF(OR(填写信息!D152=\"\",填写信息!D152=\"FCL\"),\"\",\"拼\"))","v":""},null,{"$f":"IF(填写信息!A152=\"\",\"\",填写信息!C152)","v":""}]
["",{"$f":"IF(AND(填写信息!A152<>\"\",填写信息!A153=\"\"),填写信息!B$3,IF(填写信息!A153<>\"\",填写信息!B$3,\"\"))","v":""},{"$f":"IF(填写信息!A153=\"\",\"\",SUBSTITUTE(SUBSTITUTE(填写信息!A153,\"'\",\"\"),\" \",\"\"))","v":""},null,{"$f":"IF(填写信息!A153=\"\",\"\",填写信息!B153&IF(OR(填写信息!D153=\"\",填写信息!D153=\"FCL\"),\"\",\"拼\"))","v":""},null,{"$f":"IF(填写信息!A153=\"\",\"\",填写信息!C153)","v":""}]
["",{"$f":"IF(AND(填写信息!A153<>\"\",填写信息!A154=\"\"),填写信息!B$3,IF(填写信息!A154<>\"\",填写信息!B$3,\"\"))","v":""},{"$f":"IF(填写信息!A154=\"\",\"\",SUBSTITUTE(SUBSTITUTE(填写信息!A154,\"'\",\"\"),\" \",\"\"))","v":""},null,{"$f":"IF(填写信息!A154=\"\",\"\",填写信息!B154&IF(OR(填写信息!D154=\"\",填写信息!D154=\"FCL\"),\"\",\"拼\"))","v":""},null,{"$f":"IF(填写信息!A154=\"\",\"\",填写信息!C154)","v":""}]
["",{"$f":"IF(AND(填写信息!A154<>\"\",填写信息!A155=\"\"),填写信息!B$3,IF(填写信息!A155<>\"\",填写信息!B$3,\"\"))","v":""},{"$f":"IF(填写信息!A155=\"\",\"\",SUBSTITUTE(SUBSTITUTE(填写信息!A155,\"'\",\"\"),\" \",\"\"))","v":""},null,{"$f":"IF(填写信息!A155=\"\",\"\",填写信息!B155&IF(OR(填写信息!D155=\"\",填写信息!D155=\"FCL\"),\"\",\"拼\"))","v":""},null,{"$f":"IF(填写信息!A155=\"\",\"\",填写信息!C155)","v":""}]
["",{"$f":"IF(AND(填写信息!A155<>\"\",填写信息!A156=\"\"),填写信息!B$3,IF(填写信息!A156<>\"\",填写信息!B$3,\"\"))","v":""},{"$f":"IF(填写信息!A156=\"\",\"\",SUBSTITUTE(SUBSTITUTE(填写信息!A156,\"'\",\"\"),\" \",\"\"))","v":""},null,{"$f":"IF(填写信息!A156=\"\",\"\",填写信息!B156&IF(OR(填写信息!D156=\"\",填写信息!D156=\"FCL\"),\"\",\"拼\"))","v":""},null,{"$f":"IF(填写信息!A156=\"\",\"\",填写信息!C156)","v":""}]
["",{"$f":"IF(AND(填写信息!A156<>\"\",填写信息!A157=\"\"),填写信息!B$3,IF(填写信息!A157<>\"\",填写信息!B$3,\"\"))","v":""},{"$f":"IF(填写信息!A157=\"\",\"\",SUBSTITUTE(SUBSTITUTE(填写信息!A157,\"'\",\"\"),\" \",\"\"))","v":""},null,{"$f":"IF(填写信息!A157=\"\",\"\",填写信息!B157&IF(OR(填写信息!D157=\"\",填写信息!D157=\"FCL\"),\"\",\"拼\"))","v":""},null,{"$f":"IF(填写信息!A157=\"\",\"\",填写信息!C157)","v":""}]
["",{"$f":"IF(AND(填写信息!A157<>\"\",填写信息!A158=\"\"),填写信息!B$3,IF(填写信息!A158<>\"\",填写信息!B$3,\"\"))","v":""},{"$f":"IF(填写信息!A158=\"\",\"\",SUBSTITUTE(SUBSTITUTE(填写信息!A158,\"'\",\"\"),\" \",\"\"))","v":""},null,{"$f":"IF(填写信息!A158=\"\",\"\",填写信息!B158&IF(OR(填写信息!D158=\"\",填写信息!D158=\"FCL\"),\"\",\"拼\"))","v":""},null,{"$f":"IF(填写信息!A158=\"\",\"\",填写信息!C158)","v":""}]
["",{"$f":"IF(AND(填写信息!A158<>\"\",填写信息!A159=\"\"),填写信息!B$3,IF(填写信息!A159<>\"\",填写信息!B$3,\"\"))","v":""},{"$f":"IF(填写信息!A159=\"\",\"\",SUBSTITUTE(SUBSTITUTE(填写信息!A159,\"'\",\"\"),\" \",\"\"))","v":""},null,{"$f":"IF(填写信息!A159=\"\",\"\",填写信息!B159&IF(OR(填写信息!D159=\"\",填写信息!D159=\"FCL\"),\"\",\"拼\"))","v":""},null,{"$f":"IF(填写信息!A159=\"\",\"\",填写信息!C159)","v":""}]
["",{"$f":"IF(AND(填写信息!A159<>\"\",填写信息!A160=\"\"),填写信息!B$3,IF(填写信息!A160<>\"\",填写信息!B$3,\"\"))","v":""},{"$f":"IF(填写信息!A160=\"\",\"\",SUBSTITUTE(SUBSTITUTE(填写信息!A160,\"'\",\"\"),\" \",\"\"))","v":""},null,{"$f":"IF(填写信息!A160=\"\",\"\",填写信息!B160&IF(OR(填写信息!D160=\"\",填写信息!D160=\"FCL\"),\"\",\"拼\"))","v":""},null,{"$f":"IF(填写信息!A160=\"\",\"\",填写信息!C160)","v":""}]
["",{"$f":"IF(AND(填写信息!A160<>\"\",填写信息!A161=\"\"),填写信息!B$3,IF(填写信息!A161<>\"\",填写信息!B$3,\"\"))","v":""},{"$f":"IF(填写信息!A161=\"\",\"\",SUBSTITUTE(SUBSTITUTE(填写信息!A161,\"'\",\"\"),\" \",\"\"))","v":""},null,{"$f":"IF(填写信息!A161=\"\",\"\",填写信息!B161&IF(OR(填写信息!D161=\"\",填写信息!D161=\"FCL\"),\"\",\"拼\"))","v":""},null,{"$f":"IF(填写信息!A161=\"\",\"\",填写信息!C161)","v":""}]
["",{"$f":"IF(AND(填写信息!A161<>\"\",填写信息!A162=\"\"),填写信息!B$3,IF(填写信息!A162<>\"\",填写信息!B$3,\"\"))","v":""},{"$f":"IF(填写信息!A162=\"\",\"\",SUBSTITUTE(SUBSTITUTE(填写信息!A162,\"'\",\"\"),\" \",\"\"))","v":""},null,{"$f":"IF(填写信息!A162=\"\",\"\",填写信息!B162&IF(OR(填写信息!D162=\"\",填写信息!D162=\"FCL\"),\"\",\"拼\"))","v":""},null,{"$f":"IF(填写信息!A162=\"\",\"\",填写信息!C162)","v":""}]
[{"$f":"IF(AND(B70=\"\",B69<>\"\"),\"结束\",IF(B69<>\"\",\"输入柜号\",\"\"))","v":""},{"$f":"IF(AND(填写信息!A162<>\"\",填写信息!A163=\"\"),填写信息!B$3,IF(填写信息!A163<>\"\",填写信息!B$3,\"\"))","v":""},{"$f":"IF(填写信息!A163=\"\",\"\",SUBSTITUTE(SUBSTITUTE(填写信息!A163,\"'\",\"\"),\" \",\"\"))","v":""},null,{"$f":"IF(填写信息!A163=\"\",\"\",填写信息!B163&IF(OR(填写信息!D163=\"\",填写信息!D163=\"FCL\"),\"\",\"拼\"))","v":""},null,{"$f":"IF(填写信息!A163=\"\",\"\",填写信息!C163)","v":""}]
["",{"$f":"IF(AND(填写信息!A163<>\"\",填写信息!A164=\"\"),填写信息!B$3,IF(填写信息!A164<>\"\",填写信息!B$3,\"\"))","v":""},{"$f":"IF(填写信息!A164=\"\",\"\",SUBSTITUTE(SUBSTITUTE(填写信息!A164,\"'\",\"\"),\" \",\"\"))","v":""},null,{"$f":"IF(填写信息!A164=\"\",\"\",填写信息!B164&IF(OR(填写信息!D164=\"\",填写信息!D164=\"FCL\"),\"\",\"拼\"))","v":""},null,{"$f":"IF(填写信息!A164=\"\",\"\",填写信息!C164)","v":""}]
["",{"$f":"IF(AND(填写信息!A164<>\"\",填写信息!A165=\"\"),填写信息!B$3,IF(填写信息!A165<>\"\",填写信息!B$3,\"\"))","v":""},{"$f":"IF(填写信息!A165=\"\",\"\",SUBSTITUTE(SUBSTITUTE(填写信息!A165,\"'\",\"\"),\" \",\"\"))","v":""},null,{"$f":"IF(填写信息!A165=\"\",\"\",填写信息!B165&IF(OR(填写信息!D165=\"\",填写信息!D165=\"FCL\"),\"\",\"拼\"))","v":""},null,{"$f":"IF(填写信息!A165=\"\",\"\",填写信息!C165)","v":""}]
["",{"$f":"IF(AND(填写信息!A165<>\"\",填写信息!A166=\"\"),填写信息!B$3,IF(填写信息!A166<>\"\",填写信息!B$3,\"\"))","v":""},{"$f":"IF(填写信息!A166=\"\",\"\",SUBSTITUTE(SUBSTITUTE(填写信息!A166,\"'\",\"\"),\" \",\"\"))","v":""},null,{"$f":"IF(填写信息!A166=\"\",\"\",填写信息!B166&IF(OR(填写信息!D166=\"\",填写信息!D166=\"FCL\"),\"\",\"拼\"))","v":""},null,{"$f":"IF(填写信息!A166=\"\",\"\",填写信息!C166)","v":""}]
["",{"$f":"IF(AND(填写信息!A166<>\"\",填写信息!A167=\"\"),填写信息!B$3,IF(填写信息!A167<>\"\",填写信息!B$3,\"\"))","v":""},{"$f":"IF(填写信息!A167=\"\",\"\",SUBSTITUTE(SUBSTITUTE(填写信息!A167,\"'\",\"\"),\" \",\"\"))","v":""},null,{"$f":"IF(填写信息!A167=\"\",\"\",填写信息!B167&IF(OR(填写信息!D167=\"\",填写信息!D167=\"FCL\"),\"\",\"拼\"))","v":""},null,{"$f":"IF(填写信息!A167=\"\",\"\",填写信息!C167)","v":""}]
["",{"$f":"IF(AND(填写信息!A167<>\"\",填写信息!A168=\"\"),填写信息!B$3,IF(填写信息!A168<>\"\",填写信息!B$3,\"\"))","v":""},{"$f":"IF(填写信息!A168=\"\",\"\",SUBSTITUTE(SUBSTITUTE(填写信息!A168,\"'\",\"\"),\" \",\"\"))","v":""},null,{"$f":"IF(填写信息!A168=\"\",\"\",填写信息!B168&IF(OR(填写信息!D168=\"\",填写信息!D168=\"FCL\"),\"\",\"拼\"))","v":""},null,{"$f":"IF(填写信息!A168=\"\",\"\",填写信息!C168)","v":""}]
["",{"$f":"IF(AND(填写信息!A168<>\"\",填写信息!A169=\"\"),填写信息!B$3,IF(填写信息!A169<>\"\",填写信息!B$3,\"\"))","v":""},{"$f":"IF(填写信息!A169=\"\",\"\",SUBSTITUTE(SUBSTITUTE(填写信息!A169,\"'\",\"\"),\" \",\"\"))","v":""},null,{"$f":"IF(填写信息!A169=\"\",\"\",填写信息!B169&IF(OR(填写信息!D169=\"\",填写信息!D169=\"FCL\"),\"\",\"拼\"))","v":""},null,{"$f":"IF(填写信息!A169=\"\",\"\",填写信息!C169)","v":""}]
["",{"$f":"IF(AND(填写信息!A169<>\"\",填写信息!A170=\"\"),填写信息!B$3,IF(填写信息!A170<>\"\",填写信息!B$3,\"\"))","v":""},{"$f":"IF(填写信息!A170=\"\",\"\",SUBSTITUTE(SUBSTITUTE(填写信息!A170,\"'\",\"\"),\" \",\"\"))","v":""},null,{"$f":"IF(填写信息!A170=\"\",\"\",填写信息!B170&IF(OR(填写信息!D170=\"\",填写信息!D170=\"FCL\"),\"\",\"拼\"))","v":""},null,{"$f":"IF(填写信息!A170=\"\",\"\",填写信息!C170)","v":""}]
["",{"$f":"IF(AND(填写信息!A170<>\"\",填写信息!A171=\"\"),填写信息!B$3,IF(填写信息!A171<>\"\",填写信息!B$3,\"\"))","v":""},{"$f":"IF(填写信息!A171=\"\",\"\",SUBSTITUTE(SUBSTITUTE(填写信息!A171,\"'\",\"\"),\" \",\"\"))","v":""},null,{"$f":"IF(填写信息!A171=\"\",\"\",填写信息!B171&IF(OR(填写信息!D171=\"\",填写信息!D171=\"FCL\"),\"\",\"拼\"))","v":""},null,{"$f":"IF(填写信息!A171=\"\",\"\",填写信息!C171)","v":""}]
["",{"$f":"IF(AND(填写信息!A171<>\"\",填写信息!A172=\"\"),填写信息!B$3,IF(填写信息!A172<>\"\",填写信息!B$3,\"\"))","v":""},{"$f":"IF(填写信息!A172=\"\",\"\",SUBSTITUTE(SUBSTITUTE(填写信息!A172,\"'\",\"\"),\" \",\"\"))","v":""},null,{"$f":"IF(填写信息!A172=\"\",\"\",填写信息!B172&IF(OR(填写信息!D172=\"\",填写信息!D172=\"FCL\"),\"\",\"拼\"))","v":""},null,{"$f":"IF(填写信息!A172=\"\",\"\",填写信息!C172)","v":""}]
["",{"$f":"IF(AND(填写信息!A172<>\"\",填写信息!A173=\"\"),填写信息!B$3,IF(填写信息!A173<>\"\",填写信息!B$3,\"\"))","v":""},{"$f":"IF(填写信息!A173=\"\",\"\",SUBSTITUTE(SUBSTITUTE(填写信息!A173,\"'\",\"\"),\" \",\"\"))","v":""},null,{"$f":"IF(填写信息!A173=\"\",\"\",填写信息!B173&IF(OR(填写信息!D173=\"\",填写信息!D173=\"FCL\"),\"\",\"拼\"))","v":""},null,{"$f":"IF(填写信息!A173=\"\",\"\",填写信息!C173)","v":""}]
["",{"$f":"IF(AND(填写信息!A173<>\"\",填写信息!A174=\"\"),填写信息!B$3,IF(填写信息!A174<>\"\",填写信息!B$3,\"\"))","v":""},{"$f":"IF(填写信息!A174=\"\",\"\",SUBSTITUTE(SUBSTITUTE(填写信息!A174,\"'\",\"\"),\" \",\"\"))","v":""},null,{"$f":"IF(填写信息!A174=\"\",\"\",填写信息!B174&IF(OR(填写信息!D174=\"\",填写信息!D174=\"FCL\"),\"\",\"拼\"))","v":""},null,{"$f":"IF(填写信息!A174=\"\",\"\",填写信息!C174)","v":""}]
["",{"$f":"IF(AND(填写信息!A174<>\"\",填写信息!A175=\"\"),填写信息!B$3,IF(填写信息!A175<>\"\",填写信息!B$3,\"\"))","v":""},{"$f":"IF(填写信息!A175=\"\",\"\",SUBSTITUTE(SUBSTITUTE(填写信息!A175,\"'\",\"\"),\" \",\"\"))","v":""},null,{"$f":"IF(填写信息!A175=\"\",\"\",填写信息!B175&IF(OR(填写信息!D175=\"\",填写信息!D175=\"FCL\"),\"\",\"拼\"))","v":""},null,{"$f":"IF(填写信息!A175=\"\",\"\",填写信息!C175)","v":""}]
["",{"$f":"IF(AND(填写信息!A175<>\"\",填写信息!A176=\"\"),填写信息!B$3,IF(填写信息!A176<>\"\",填写信息!B$3,\"\"))","v":""},{"$f":"IF(填写信息!A176=\"\",\"\",SUBSTITUTE(SUBSTITUTE(填写信息!A176,\"'\",\"\"),\" \",\"\"))","v":""},null,{"$f":"IF(填写信息!A176=\"\",\"\",填写信息!B176&IF(OR(填写信息!D176=\"\",填写信息!D176=\"FCL\"),\"\",\"拼\"))","v":""},null,{"$f":"IF(填写信息!A176=\"\",\"\",填写信息!C176)","v":""}]
["",{"$f":"IF(AND(填写信息!A176<>\"\",填写信息!A177=\"\"),填写信息!B$3,IF(填写信息!A177<>\"\",填写信息!B$3,\"\"))","v":""},{"$f":"IF(填写信息!A177=\"\",\"\",SUBSTITUTE(SUBSTITUTE(填写信息!A177,\"'\",\"\"),\" \",\"\"))","v":""},null,{"$f":"IF(填写信息!A177=\"\",\"\",填写信息!B177&IF(OR(填写信息!D177=\"\",填写信息!D177=\"FCL\"),\"\",\"拼\"))","v":""},null,{"$f":"IF(填写信息!A177=\"\",\"\",填写信息!C177)","v":""}]
["",{"$f":"IF(AND(填写信息!A177<>\"\",填写信息!A178=\"\"),填写信息!B$3,IF(填写信息!A178<>\"\",填写信息!B$3,\"\"))","v":""},{"$f":"IF(填写信息!A178=\"\",\"\",SUBSTITUTE(SUBSTITUTE(填写信息!A178,\"'\",\"\"),\" \",\"\"))","v":""},null,{"$f":"IF(填写信息!A178=\"\",\"\",填写信息!B178&IF(OR(填写信息!D178=\"\",填写信息!D178=\"FCL\"),\"\",\"拼\"))","v":""},null,{"$f":"IF(填写信息!A178=\"\",\"\",填写信息!C178)","v":""}]
["",{"$f":"IF(AND(填写信息!A178<>\"\",填写信息!A179=\"\"),填写信息!B$3,IF(填写信息!A179<>\"\",填写信息!B$3,\"\"))","v":""},{"$f":"IF(填写信息!A179=\"\",\"\",SUBSTITUTE(SUBSTITUTE(填写信息!A179,\"'\",\"\"),\" \",\"\"))","v":""},null,{"$f":"IF(填写信息!A179=\"\",\"\",填写信息!B179&IF(OR(填写信息!D179=\"\",填写信息!D179=\"FCL\"),\"\",\"拼\"))","v":""},null,{"$f":"IF(填写信息!A179=\"\",\"\",填写信息!C179)","v":""}]
["",{"$f":"IF(AND(填写信息!A179<>\"\",填写信息!A180=\"\"),填写信息!B$3,IF(填写信息!A180<>\"\",填写信息!B$3,\"\"))","v":""},{"$f":"IF(填写信息!A180=\"\",\"\",SUBSTITUTE(SUBSTITUTE(填写信息!A180,\"'\",\"\"),\" \",\"\"))","v":""},null,{"$f":"IF(填写信息!A180=\"\",\"\",填写信息!B180&IF(OR(填写信息!D180=\"\",填写信息!D180=\"FCL\"),\"\",\"拼\"))","v":""},null,{"$f":"IF(填写信息!A180=\"\",\"\",填写信息!C180)","v":""}]
["",{"$f":"IF(AND(填写信息!A180<>\"\",填写信息!A181=\"\"),填写信息!B$3,IF(填写信息!A181<>\"\",填写信息!B$3,\"\"))","v":""},{"$f":"IF(填写信息!A181=\"\",\"\",SUBSTITUTE(SUBSTITUTE(填写信息!A181,\"'\",\"\"),\" \",\"\"))","v":""},null,{"$f":"IF(填写信息!A181=\"\",\"\",填写信息!B181&IF(OR(填写信息!D181=\"\",填写信息!D181=\"FCL\"),\"\",\"拼\"))","v":""},null,{"$f":"IF(填写信息!A181=\"\",\"\",填写信息!C181)","v":""}]
["",{"$f":"IF(AND(填写信息!A181<>\"\",填写信息!A182=\"\"),填写信息!B$3,IF(填写信息!A182<>\"\",填写信息!B$3,\"\"))","v":""},{"$f":"IF(填写信息!A182=\"\",\"\",SUBSTITUTE(SUBSTITUTE(填写信息!A182,\"'\",\"\"),\" \",\"\"))","v":""},null,{"$f":"IF(填写信息!A182=\"\",\"\",填写信息!B182&IF(OR(填写信息!D182=\"\",填写信息!D182=\"FCL\"),\"\",\"拼\"))","v":""},null,{"$f":"IF(填写信息!A182=\"\",\"\",填写信息!C182)","v":""}]
["",{"$f":"IF(AND(填写信息!A182<>\"\",填写信息!A183=\"\"),填写信息!B$3,IF(填写信息!A183<>\"\",填写信息!B$3,\"\"))","v":""},{"$f":"IF(填写信息!A183=\"\",\"\",SUBSTITUTE(SUBSTITUTE(填写信息!A183,\"'\",\"\"),\" \",\"\"))","v":""},null,{"$f":"IF(填写信息!A183=\"\",\"\",填写信息!B183&IF(OR(填写信息!D183=\"\",填写信息!D183=\"FCL\"),\"\",\"拼\"))","v":""},null,{"$f":"IF(填写信息!A183=\"\",\"\",填写信息!C183)","v":""}]
["",{"$f":"IF(AND(填写信息!A183<>\"\",填写信息!A184=\"\"),填写信息!B$3,IF(填写信息!A184<>\"\",填写信息!B$3,\"\"))","v":""},{"$f":"IF(填写信息!A184=\"\",\"\",SUBSTITUTE(SUBSTITUTE(填写信息!A184,\"'\",\"\"),\" \",\"\"))","v":""},null,{"$f":"IF(填写信息!A184=\"\",\"\",填写信息!B184&IF(OR(填写信息!D184=\"\",填写信息!D184=\"FCL\"),\"\",\"拼\"))","v":""},null,{"$f":"IF(填写信息!A184=\"\",\"\",填写信息!C184)","v":""}]
["",{"$f":"IF(AND(填写信息!A184<>\"\",填写信息!A185=\"\"),填写信息!B$3,IF(填写信息!A185<>\"\",填写信息!B$3,\"\"))","v":""},{"$f":"IF(填写信息!A185=\"\",\"\",SUBSTITUTE(SUBSTITUTE(填写信息!A185,\"'\",\"\"),\" \",\"\"))","v":""},null,{"$f":"IF(填写信息!A185=\"\",\"\",填写信息!B185&IF(OR(填写信息!D185=\"\",填写信息!D185=\"FCL\"),\"\",\"拼\"))","v":""},null,{"$f":"IF(填写信息!A185=\"\",\"\",填写信息!C185)","v":""}]
["",{"$f":"IF(AND(填写信息!A185<>\"\",填写信息!A186=\"\"),填写信息!B$3,IF(填写信息!A186<>\"\",填写信息!B$3,\"\"))","v":""},{"$f":"IF(填写信息!A186=\"\",\"\",SUBSTITUTE(SUBSTITUTE(填写信息!A186,\"'\",\"\"),\" \",\"\"))","v":""},null,{"$f":"IF(填写信息!A186=\"\",\"\",填写信息!B186&IF(OR(填写信息!D186=\"\",填写信息!D186=\"FCL\"),\"\",\"拼\"))","v":""},null,{"$f":"IF(填写信息!A186=\"\",\"\",填写信息!C186)","v":""}]
["",{"$f":"IF(AND(填写信息!A186<>\"\",填写信息!A187=\"\"),填写信息!B$3,IF(填写信息!A187<>\"\",填写信息!B$3,\"\"))","v":""},{"$f":"IF(填写信息!A187=\"\",\"\",SUBSTITUTE(SUBSTITUTE(填写信息!A187,\"'\",\"\"),\" \",\"\"))","v":""},null,{"$f":"IF(填写信息!A187=\"\",\"\",填写信息!B187&IF(OR(填写信息!D187=\"\",填写信息!D187=\"FCL\"),\"\",\"拼\"))","v":""},null,{"$f":"IF(填写信息!A187=\"\",\"\",填写信息!C187)","v":""}]
["",{"$f":"IF(AND(填写信息!A187<>\"\",填写信息!A188=\"\"),填写信息!B$3,IF(填写信息!A188<>\"\",填写信息!B$3,\"\"))","v":""},{"$f":"IF(填写信息!A188=\"\",\"\",SUBSTITUTE(SUBSTITUTE(填写信息!A188,\"'\",\"\"),\" \",\"\"))","v":""},null,{"$f":"IF(填写信息!A188=\"\",\"\",填写信息!B188&IF(OR(填写信息!D188=\"\",填写信息!D188=\"FCL\"),\"\",\"拼\"))","v":""},null,{"$f":"IF(填写信息!A188=\"\",\"\",填写信息!C188)","v":""}]
["",{"$f":"IF(AND(填写信息!A188<>\"\",填写信息!A189=\"\"),填写信息!B$3,IF(填写信息!A189<>\"\",填写信息!B$3,\"\"))","v":""},{"$f":"IF(填写信息!A189=\"\",\"\",SUBSTITUTE(SUBSTITUTE(填写信息!A189,\"'\",\"\"),\" \",\"\"))","v":""},null,{"$f":"IF(填写信息!A189=\"\",\"\",填写信息!B189&IF(OR(填写信息!D189=\"\",填写信息!D189=\"FCL\"),\"\",\"拼\"))","v":""},null,{"$f":"IF(填写信息!A189=\"\",\"\",填写信息!C189)","v":""}]
["",{"$f":"IF(AND(填写信息!A189<>\"\",填写信息!A190=\"\"),填写信息!B$3,IF(填写信息!A190<>\"\",填写信息!B$3,\"\"))","v":""},{"$f":"IF(填写信息!A190=\"\",\"\",SUBSTITUTE(SUBSTITUTE(填写信息!A190,\"'\",\"\"),\" \",\"\"))","v":""},null,{"$f":"IF(填写信息!A190=\"\",\"\",填写信息!B190&IF(OR(填写信息!D190=\"\",填写信息!D190=\"FCL\"),\"\",\"拼\"))","v":""},null,{"$f":"IF(填写信息!A190=\"\",\"\",填写信息!C190)","v":""}]
["",{"$f":"IF(AND(填写信息!A190<>\"\",填写信息!A191=\"\"),填写信息!B$3,IF(填写信息!A191<>\"\",填写信息!B$3,\"\"))","v":""},{"$f":"IF(填写信息!A191=\"\",\"\",SUBSTITUTE(SUBSTITUTE(填写信息!A191,\"'\",\"\"),\" \",\"\"))","v":""},null,{"$f":"IF(填写信息!A191=\"\",\"\",填写信息!B191&IF(OR(填写信息!D191=\"\",填写信息!D191=\"FCL\"),\"\",\"拼\"))","v":""},null,{"$f":"IF(填写信息!A191=\"\",\"\",填写信息!C191)","v":""}]
["",{"$f":"IF(AND(填写信息!A191<>\"\",填写信息!A192=\"\"),填写信息!B$3,IF(填写信息!A192<>\"\",填写信息!B$3,\"\"))","v":""},{"$f":"IF(填写信息!A192=\"\",\"\",SUBSTITUTE(SUBSTITUTE(填写信息!A192,\"'\",\"\"),\" \",\"\"))","v":""},null,{"$f":"IF(填写信息!A192=\"\",\"\",填写信息!B192&IF(OR(填写信息!D192=\"\",填写信息!D192=\"FCL\"),\"\",\"拼\"))","v":""},null,{"$f":"IF(填写信息!A192=\"\",\"\",填写信息!C192)","v":""}]
["",{"$f":"IF(AND(填写信息!A192<>\"\",填写信息!A193=\"\"),填写信息!B$3,IF(填写信息!A193<>\"\",填写信息!B$3,\"\"))","v":""},{"$f":"IF(填写信息!A193=\"\",\"\",SUBSTITUTE(SUBSTITUTE(填写信息!A193,\"'\",\"\"),\" \",\"\"))","v":""},null,{"$f":"IF(填写信息!A193=\"\",\"\",填写信息!B193&IF(OR(填写信息!D193=\"\",填写信息!D193=\"FCL\"),\"\",\"拼\"))","v":""},null,{"$f":"IF(填写信息!A193=\"\",\"\",填写信息!C193)","v":""}]
["",{"$f":"IF(AND(填写信息!A193<>\"\",填写信息!A194=\"\"),填写信息!B$3,IF(填写信息!A194<>\"\",填写信息!B$3,\"\"))","v":""},{"$f":"IF(填写信息!A194=\"\",\"\",SUBSTITUTE(SUBSTITUTE(填写信息!A194,\"'\",\"\"),\" \",\"\"))","v":""},null,{"$f":"IF(填写信息!A194=\"\",\"\",填写信息!B194&IF(OR(填写信息!D194=\"\",填写信息!D194=\"FCL\"),\"\",\"拼\"))","v":""},null,{"$f":"IF(填写信息!A194=\"\",\"\",填写信息!C194)","v":""}]
["",{"$f":"IF(AND(填写信息!A194<>\"\",填写信息!A195=\"\"),填写信息!B$3,IF(填写信息!A195<>\"\",填写信息!B$3,\"\"))","v":""},{"$f":"IF(填写信息!A195=\"\",\"\",SUBSTITUTE(SUBSTITUTE(填写信息!A195,\"'\",\"\"),\" \",\"\"))","v":""},null,{"$f":"IF(填写信息!A195=\"\",\"\",填写信息!B195&IF(OR(填写信息!D195=\"\",填写信息!D195=\"FCL\"),\"\",\"拼\"))","v":""},null,{"$f":"IF(填写信息!A195=\"\",\"\",填写信息!C195)","v":""}]
["",{"$f":"IF(AND(填写信息!A195<>\"\",填写信息!A196=\"\"),填写信息!B$3,IF(填写信息!A196<>\"\",填写信息!B$3,\"\"))","v":""},{"$f":"IF(填写信息!A196=\"\",\"\",SUBSTITUTE(SUBSTITUTE(填写信息!A196,\"'\",\"\"),\" \",\"\"))","v":""},null,{"$f":"IF(填写信息!A196=\"\",\"\",填写信息!B196&IF(OR(填写信息!D196=\"\",填写信息!D196=\"FCL\"),\"\",\"拼\"))","v":""},null,{"$f":"IF(填写信息!A196=\"\",\"\",填写信息!C196)","v":""}]
["",{"$f":"IF(AND(填写信息!A196<>\"\",填写信息!A197=\"\"),填写信息!B$3,IF(填写信息!A197<>\"\",填写信息!B$3,\"\"))","v":""},{"$f":"IF(填写信息!A197=\"\",\"\",SUBSTITUTE(SUBSTITUTE(填写信息!A197,\"'\",\"\"),\" \",\"\"))","v":""},null,{"$f":"IF(填写信息!A197=\"\",\"\",填写信息!B197&IF(OR(填写信息!D197=\"\",填写信息!D197=\"FCL\"),\"\",\"拼\"))","v":""},null,{"$f":"IF(填写信息!A197=\"\",\"\",填写信息!C197)","v":""}]
["",{"$f":"IF(AND(填写信息!A197<>\"\",填写信息!A198=\"\"),填写信息!B$3,IF(填写信息!A198<>\"\",填写信息!B$3,\"\"))","v":""},{"$f":"IF(填写信息!A198=\"\",\"\",SUBSTITUTE(SUBSTITUTE(填写信息!A198,\"'\",\"\"),\" \",\"\"))","v":""},null,{"$f":"IF(填写信息!A198=\"\",\"\",填写信息!B198&IF(OR(填写信息!D198=\"\",填写信息!D198=\"FCL\"),\"\",\"拼\"))","v":""},null,{"$f":"IF(填写信息!A198=\"\",\"\",填写信息!C198)","v":""}]
["",{"$f":"IF(AND(填写信息!A198<>\"\",填写信息!A199=\"\"),填写信息!B$3,IF(填写信息!A199<>\"\",填写信息!B$3,\"\"))","v":""},{"$f":"IF(填写信息!A199=\"\",\"\",SUBSTITUTE(SUBSTITUTE(填写信息!A199,\"'\",\"\"),\" \",\"\"))","v":""},null,{"$f":"IF(填写信息!A199=\"\",\"\",填写信息!B199&IF(OR(填写信息!D199=\"\",填写信息!D199=\"FCL\"),\"\",\"拼\"))","v":""},null,{"$f":"IF(填写信息!A199=\"\",\"\",填写信息!C199)","v":""}]
["",{"$f":"IF(AND(填写信息!A199<>\"\",填写信息!A200=\"\"),填写信息!B$3,IF(填写信息!A200<>\"\",填写信息!B$3,\"\"))","v":""},{"$f":"IF(填写信息!A200=\"\",\"\",SUBSTITUTE(SUBSTITUTE(填写信息!A200,\"'\",\"\"),\" \",\"\"))","v":""},null,{"$f":"IF(填写信息!A200=\"\",\"\",填写信息!B200&IF(OR(填写信息!D200=\"\",填写信息!D200=\"FCL\"),\"\",\"拼\"))","v":""},null,{"$f":"IF(填写信息!A200=\"\",\"\",填写信息!C200)","v":""}]
["",{"$f":"IF(AND(填写信息!A200<>\"\",填写信息!A201=\"\"),填写信息!B$3,IF(填写信息!A201<>\"\",填写信息!B$3,\"\"))","v":""},{"$f":"IF(填写信息!A201=\"\",\"\",SUBSTITUTE(SUBSTITUTE(填写信息!A201,\"'\",\"\"),\" \",\"\"))","v":""},null,{"$f":"IF(填写信息!A201=\"\",\"\",填写信息!B201&IF(OR(填写信息!D201=\"\",填写信息!D201=\"FCL\"),\"\",\"拼\"))","v":""},null,{"$f":"IF(填写信息!A201=\"\",\"\",填写信息!C201)","v":""}]
["",{"$f":"IF(AND(填写信息!A201<>\"\",填写信息!A202=\"\"),填写信息!B$3,IF(填写信息!A202<>\"\",填写信息!B$3,\"\"))","v":""},{"$f":"IF(填写信息!A202=\"\",\"\",SUBSTITUTE(SUBSTITUTE(填写信息!A202,\"'\",\"\"),\" \",\"\"))","v":""},null,{"$f":"IF(填写信息!A202=\"\",\"\",填写信息!B202&IF(OR(填写信息!D202=\"\",填写信息!D202=\"FCL\"),\"\",\"拼\"))","v":""},null,{"$f":"IF(填写信息!A202=\"\",\"\",填写信息!C202)","v":""}]
["",{"$f":"IF(AND(填写信息!A202<>\"\",填写信息!A203=\"\"),填写信息!B$3,IF(填写信息!A203<>\"\",填写信息!B$3,\"\"))","v":""},{"$f":"IF(填写信息!A203=\"\",\"\",SUBSTITUTE(SUBSTITUTE(填写信息!A203,\"'\",\"\"),\" \",\"\"))","v":""},null,{"$f":"IF(填写信息!A203=\"\",\"\",填写信息!B203&IF(OR(填写信息!D203=\"\",填写信息!D203=\"FCL\"),\"\",\"拼\"))","v":""},null,{"$f":"IF(填写信息!A203=\"\",\"\",填写信息!C203)","v":""}]
["",{"$f":"IF(AND(填写信息!A203<>\"\",填写信息!A204=\"\"),填写信息!B$3,IF(填写信息!A204<>\"\",填写信息!B$3,\"\"))","v":""},{"$f":"IF(填写信息!A204=\"\",\"\",SUBSTITUTE(SUBSTITUTE(填写信息!A204,\"'\",\"\"),\" \",\"\"))","v":""},null,{"$f":"IF(填写信息!A204=\"\",\"\",填写信息!B204&IF(OR(填写信息!D204=\"\",填写信息!D204=\"FCL\"),\"\",\"拼\"))","v":""},null,{"$f":"IF(填写信息!A204=\"\",\"\",填写信息!C204)","v":""}]
["",{"$f":"IF(AND(填写信息!A204<>\"\",填写信息!A205=\"\"),填写信息!B$3,IF(填写信息!A205<>\"\",填写信息!B$3,\"\"))","v":""},{"$f":"IF(填写信息!A205=\"\",\"\",SUBSTITUTE(SUBSTITUTE(填写信息!A205,\"'\",\"\"),\" \",\"\"))","v":""},null,{"$f":"IF(填写信息!A205=\"\",\"\",填写信息!B205&IF(OR(填写信息!D205=\"\",填写信息!D205=\"FCL\"),\"\",\"拼\"))","v":""},null,{"$f":"IF(填写信息!A205=\"\",\"\",填写信息!C205)","v":""}]
["",{"$f":"IF(AND(填写信息!A205<>\"\",填写信息!A206=\"\"),填写信息!B$3,IF(填写信息!A206<>\"\",填写信息!B$3,\"\"))","v":""},{"$f":"IF(填写信息!A206=\"\",\"\",SUBSTITUTE(SUBSTITUTE(填写信息!A206,\"'\",\"\"),\" \",\"\"))","v":""},null,{"$f":"IF(填写信息!A206=\"\",\"\",填写信息!B206&IF(OR(填写信息!D206=\"\",填写信息!D206=\"FCL\"),\"\",\"拼\"))","v":""},null,{"$f":"IF(填写信息!A206=\"\",\"\",填写信息!C206)","v":""}]
["",{"$f":"IF(AND(填写信息!A206<>\"\",填写信息!A207=\"\"),填写信息!B$3,IF(填写信息!A207<>\"\",填写信息!B$3,\"\"))","v":""},{"$f":"IF(填写信息!A207=\"\",\"\",SUBSTITUTE(SUBSTITUTE(填写信息!A207,\"'\",\"\"),\" \",\"\"))","v":""},null,{"$f":"IF(填写信息!A207=\"\",\"\",填写信息!B207&IF(OR(填写信息!D207=\"\",填写信息!D207=\"FCL\"),\"\",\"拼\"))","v":""},null,{"$f":"IF(填写信息!A207=\"\",\"\",填写信息!C207)","v":""}]
["",{"$f":"IF(AND(填写信息!A207<>\"\",填写信息!A208=\"\"),填写信息!B$3,IF(填写信息!A208<>\"\",填写信息!B$3,\"\"))","v":""},{"$f":"IF(填写信息!A208=\"\",\"\",SUBSTITUTE(SUBSTITUTE(填写信息!A208,\"'\",\"\"),\" \",\"\"))","v":""},null,{"$f":"IF(填写信息!A208=\"\",\"\",填写信息!B208&IF(OR(填写信息!D208=\"\",填写信息!D208=\"FCL\"),\"\",\"拼\"))","v":""},null,{"$f":"IF(填写信息!A208=\"\",\"\",填写信息!C208)","v":""}]
["",{"$f":"IF(AND(填写信息!A208<>\"\",填写信息!A209=\"\"),填写信息!B$3,IF(填写信息!A209<>\"\",填写信息!B$3,\"\"))","v":""},{"$f":"IF(填写信息!A209=\"\",\"\",SUBSTITUTE(SUBSTITUTE(填写信息!A209,\"'\",\"\"),\" \",\"\"))","v":""},null,{"$f":"IF(填写信息!A209=\"\",\"\",填写信息!B209&IF(OR(填写信息!D209=\"\",填写信息!D209=\"FCL\"),\"\",\"拼\"))","v":""},null,{"$f":"IF(填写信息!A209=\"\",\"\",填写信息!C209)","v":""}]
["",{"$f":"IF(AND(填写信息!A209<>\"\",填写信息!A210=\"\"),填写信息!B$3,IF(填写信息!A210<>\"\",填写信息!B$3,\"\"))","v":""},{"$f":"IF(填写信息!A210=\"\",\"\",SUBSTITUTE(SUBSTITUTE(填写信息!A210,\"'\",\"\"),\" \",\"\"))","v":""},null,{"$f":"IF(填写信息!A210=\"\",\"\",填写信息!B210&IF(OR(填写信息!D210=\"\",填写信息!D210=\"FCL\"),\"\",\"拼\"))","v":""},null,{"$f":"IF(填写信息!A210=\"\",\"\",填写信息!C210)","v":""}]
["",{"$f":"IF(AND(填写信息!A210<>\"\",填写信息!A211=\"\"),填写信息!B$3,IF(填写信息!A211<>\"\",填写信息!B$3,\"\"))","v":""},{"$f":"IF(填写信息!A211=\"\",\"\",SUBSTITUTE(SUBSTITUTE(填写信息!A211,\"'\",\"\"),\" \",\"\"))","v":""},null,{"$f":"IF(填写信息!A211=\"\",\"\",填写信息!B211&IF(OR(填写信息!D211=\"\",填写信息!D211=\"FCL\"),\"\",\"拼\"))","v":""},null,{"$f":"IF(填写信息!A211=\"\",\"\",填写信息!C211)","v":""}]
["",{"$f":"IF(AND(填写信息!A211<>\"\",填写信息!A212=\"\"),填写信息!B$3,IF(填写信息!A212<>\"\",填写信息!B$3,\"\"))","v":""},{"$f":"IF(填写信息!A212=\"\",\"\",SUBSTITUTE(SUBSTITUTE(填写信息!A212,\"'\",\"\"),\" \",\"\"))","v":""},null,{"$f":"IF(填写信息!A212=\"\",\"\",填写信息!B212&IF(OR(填写信息!D212=\"\",填写信息!D212=\"FCL\"),\"\",\"拼\"))","v":""},null,{"$f":"IF(填写信息!A212=\"\",\"\",填写信息!C212)","v":""}]
["",{"$f":"IF(AND(填写信息!A212<>\"\",填写信息!A213=\"\"),填写信息!B$3,IF(填写信息!A213<>\"\",填写信息!B$3,\"\"))","v":""},{"$f":"IF(填写信息!A213=\"\",\"\",SUBSTITUTE(SUBSTITUTE(填写信息!A213,\"'\",\"\"),\" \",\"\"))","v":""},null,{"$f":"IF(填写信息!A213=\"\",\"\",填写信息!B213&IF(OR(填写信息!D213=\"\",填写信息!D213=\"FCL\"),\"\",\"拼\"))","v":""},null,{"$f":"IF(填写信息!A213=\"\",\"\",填写信息!C213)","v":""}]
["",{"$f":"IF(AND(填写信息!A213<>\"\",填写信息!A214=\"\"),填写信息!B$3,IF(填写信息!A214<>\"\",填写信息!B$3,\"\"))","v":""},{"$f":"IF(填写信息!A214=\"\",\"\",SUBSTITUTE(SUBSTITUTE(填写信息!A214,\"'\",\"\"),\" \",\"\"))","v":""},null,{"$f":"IF(填写信息!A214=\"\",\"\",填写信息!B214&IF(OR(填写信息!D214=\"\",填写信息!D214=\"FCL\"),\"\",\"拼\"))","v":""},null,{"$f":"IF(填写信息!A214=\"\",\"\",填写信息!C214)","v":""}]
["",{"$f":"IF(AND(填写信息!A214<>\"\",填写信息!A215=\"\"),填写信息!B$3,IF(填写信息!A215<>\"\",填写信息!B$3,\"\"))","v":""},{"$f":"IF(填写信息!A215=\"\",\"\",SUBSTITUTE(SUBSTITUTE(填写信息!A215,\"'\",\"\"),\" \",\"\"))","v":""},null,{"$f":"IF(填写信息!A215=\"\",\"\",填写信息!B215&IF(OR(填写信息!D215=\"\",填写信息!D215=\"FCL\"),\"\",\"拼\"))","v":""},null,{"$f":"IF(填写信息!A215=\"\",\"\",填写信息!C215)","v":""}]
["",{"$f":"IF(AND(填写信息!A215<>\"\",填写信息!A216=\"\"),填写信息!B$3,IF(填写信息!A216<>\"\",填写信息!B$3,\"\"))","v":""},{"$f":"IF(填写信息!A216=\"\",\"\",SUBSTITUTE(SUBSTITUTE(填写信息!A216,\"'\",\"\"),\" \",\"\"))","v":""},null,{"$f":"IF(填写信息!A216=\"\",\"\",填写信息!B216&IF(OR(填写信息!D216=\"\",填写信息!D216=\"FCL\"),\"\",\"拼\"))","v":""},null,{"$f":"IF(填写信息!A216=\"\",\"\",填写信息!C216)","v":""}]
["",{"$f":"IF(AND(填写信息!A216<>\"\",填写信息!A217=\"\"),填写信息!B$3,IF(填写信息!A217<>\"\",填写信息!B$3,\"\"))","v":""},{"$f":"IF(填写信息!A217=\"\",\"\",SUBSTITUTE(SUBSTITUTE(填写信息!A217,\"'\",\"\"),\" \",\"\"))","v":""},null,{"$f":"IF(填写信息!A217=\"\",\"\",填写信息!B217&IF(OR(填写信息!D217=\"\",填写信息!D217=\"FCL\"),\"\",\"拼\"))","v":""},null,{"$f":"IF(填写信息!A217=\"\",\"\",填写信息!C217)","v":""}]
["",{"$f":"IF(AND(填写信息!A217<>\"\",填写信息!A218=\"\"),填写信息!B$3,IF(填写信息!A218<>\"\",填写信息!B$3,\"\"))","v":""},{"$f":"IF(填写信息!A218=\"\",\"\",SUBSTITUTE(SUBSTITUTE(填写信息!A218,\"'\",\"\"),\" \",\"\"))","v":""},null,{"$f":"IF(填写信息!A218=\"\",\"\",填写信息!B218&IF(OR(填写信息!D218=\"\",填写信息!D218=\"FCL\"),\"\",\"拼\"))","v":""},null,{"$f":"IF(填写信息!A218=\"\",\"\",填写信息!C218)","v":""}]
["",{"$f":"IF(AND(填写信息!A218<>\"\",填写信息!A219=\"\"),填写信息!B$3,IF(填写信息!A219<>\"\",填写信息!B$3,\"\"))","v":""},{"$f":"IF(填写信息!A219=\"\",\"\",SUBSTITUTE(SUBSTITUTE(填写信息!A219,\"'\",\"\"),\" \",\"\"))","v":""},null,{"$f":"IF(填写信息!A219=\"\",\"\",填写信息!B219&IF(OR(填写信息!D219=\"\",填写信息!D219=\"FCL\"),\"\",\"拼\"))","v":""},null,{"$f":"IF(填写信息!A219=\"\",\"\",填写信息!C219)","v":""}]
["",{"$f":"IF(AND(填写信息!A219<>\"\",填写信息!A220=\"\"),填写信息!B$3,IF(填写信息!A220<>\"\",填写信息!B$3,\"\"))","v":""},{"$f":"IF(填写信息!A220=\"\",\"\",SUBSTITUTE(SUBSTITUTE(填写信息!A220,\"'\",\"\"),\" \",\"\"))","v":""},null,{"$f":"IF(填写信息!A220=\"\",\"\",填写信息!B220&IF(OR(填写信息!D220=\"\",填写信息!D220=\"FCL\"),\"\",\"拼\"))","v":""},null,{"$f":"IF(填写信息!A220=\"\",\"\",填写信息!C220)","v":""}]
["",{"$f":"IF(AND(填写信息!A220<>\"\",填写信息!A221=\"\"),填写信息!B$3,IF(填写信息!A221<>\"\",填写信息!B$3,\"\"))","v":""},{"$f":"IF(填写信息!A221=\"\",\"\",SUBSTITUTE(SUBSTITUTE(填写信息!A221,\"'\",\"\"),\" \",\"\"))","v":""},null,{"$f":"IF(填写信息!A221=\"\",\"\",填写信息!B221&IF(OR(填写信息!D221=\"\",填写信息!D221=\"FCL\"),\"\",\"拼\"))","v":""},null,{"$f":"IF(填写信息!A221=\"\",\"\",填写信息!C221)","v":""}]
["",{"$f":"IF(AND(填写信息!A221<>\"\",填写信息!A222=\"\"),填写信息!B$3,IF(填写信息!A222<>\"\",填写信息!B$3,\"\"))","v":""},{"$f":"IF(填写信息!A222=\"\",\"\",SUBSTITUTE(SUBSTITUTE(填写信息!A222,\"'\",\"\"),\" \",\"\"))","v":""},null,{"$f":"IF(填写信息!A222=\"\",\"\",填写信息!B222&IF(OR(填写信息!D222=\"\",填写信息!D222=\"FCL\"),\"\",\"拼\"))","v":""},null,{"$f":"IF(填写信息!A222=\"\",\"\",填写信息!C222)","v":""}]
["",{"$f":"IF(AND(填写信息!A222<>\"\",填写信息!A223=\"\"),填写信息!B$3,IF(填写信息!A223<>\"\",填写信息!B$3,\"\"))","v":""},{"$f":"IF(填写信息!A223=\"\",\"\",SUBSTITUTE(SUBSTITUTE(填写信息!A223,\"'\",\"\"),\" \",\"\"))","v":""},null,{"$f":"IF(填写信息!A223=\"\",\"\",填写信息!B223&IF(OR(填写信息!D223=\"\",填写信息!D223=\"FCL\"),\"\",\"拼\"))","v":""},null,{"$f":"IF(填写信息!A223=\"\",\"\",填写信息!C223)","v":""}]
["",{"$f":"IF(AND(填写信息!A223<>\"\",填写信息!A224=\"\"),填写信息!B$3,IF(填写信息!A224<>\"\",填写信息!B$3,\"\"))","v":""},{"$f":"IF(填写信息!A224=\"\",\"\",SUBSTITUTE(SUBSTITUTE(填写信息!A224,\"'\",\"\"),\" \",\"\"))","v":""},null,{"$f":"IF(填写信息!A224=\"\",\"\",填写信息!B224&IF(OR(填写信息!D224=\"\",填写信息!D224=\"FCL\"),\"\",\"拼\"))","v":""},null,{"$f":"IF(填写信息!A224=\"\",\"\",填写信息!C224)","v":""}]
["",{"$f":"IF(AND(填写信息!A224<>\"\",填写信息!A225=\"\"),填写信息!B$3,IF(填写信息!A225<>\"\",填写信息!B$3,\"\"))","v":""},{"$f":"IF(填写信息!A225=\"\",\"\",SUBSTITUTE(SUBSTITUTE(填写信息!A225,\"'\",\"\"),\" \",\"\"))","v":""},null,{"$f":"IF(填写信息!A225=\"\",\"\",填写信息!B225&IF(OR(填写信息!D225=\"\",填写信息!D225=\"FCL\"),\"\",\"拼\"))","v":""},null,{"$f":"IF(填写信息!A225=\"\",\"\",填写信息!C225)","v":""}]
["",{"$f":"IF(AND(填写信息!A225<>\"\",填写信息!A226=\"\"),填写信息!B$3,IF(填写信息!A226<>\"\",填写信息!B$3,\"\"))","v":""},{"$f":"IF(填写信息!A226=\"\",\"\",SUBSTITUTE(SUBSTITUTE(填写信息!A226,\"'\",\"\"),\" \",\"\"))","v":""},null,{"$f":"IF(填写信息!A226=\"\",\"\",填写信息!B226&IF(OR(填写信息!D226=\"\",填写信息!D226=\"FCL\"),\"\",\"拼\"))","v":""},null,{"$f":"IF(填写信息!A226=\"\",\"\",填写信息!C226)","v":""}]
[{"$f":"IF(AND(B134=\"\",B133<>\"\"),\"结束\",IF(B133<>\"\",\"输入柜号\",\"\"))","v":""},{"$f":"IF(AND(填写信息!A226<>\"\",填写信息!A227=\"\"),填写信息!B$3,IF(填写信息!A227<>\"\",填写信息!B$3,\"\"))","v":""},{"$f":"IF(填写信息!A227=\"\",\"\",SUBSTITUTE(SUBSTITUTE(填写信息!A227,\"'\",\"\"),\" \",\"\"))","v":""},null,{"$f":"IF(填写信息!A227=\"\",\"\",填写信息!B227&IF(OR(填写信息!D227=\"\",填写信息!D227=\"FCL\"),\"\",\"拼\"))","v":""},null,{"$f":"IF(填写信息!A227=\"\",\"\",填写信息!C227)","v":""}]
["",{"$f":"IF(AND(填写信息!A227<>\"\",填写信息!A228=\"\"),填写信息!B$3,IF(填写信息!A228<>\"\",填写信息!B$3,\"\"))","v":""},{"$f":"IF(填写信息!A228=\"\",\"\",SUBSTITUTE(SUBSTITUTE(填写信息!A228,\"'\",\"\"),\" \",\"\"))","v":""},null,{"$f":"IF(填写信息!A228=\"\",\"\",填写信息!B228&IF(OR(填写信息!D228=\"\",填写信息!D228=\"FCL\"),\"\",\"拼\"))","v":""},null,{"$f":"IF(填写信息!A228=\"\",\"\",填写信息!C228)","v":""}]
["",{"$f":"IF(AND(填写信息!A228<>\"\",填写信息!A229=\"\"),填写信息!B$3,IF(填写信息!A229<>\"\",填写信息!B$3,\"\"))","v":""},{"$f":"IF(填写信息!A229=\"\",\"\",SUBSTITUTE(SUBSTITUTE(填写信息!A229,\"'\",\"\"),\" \",\"\"))","v":""},null,{"$f":"IF(填写信息!A229=\"\",\"\",填写信息!B229&IF(OR(填写信息!D229=\"\",填写信息!D229=\"FCL\"),\"\",\"拼\"))","v":""},null,{"$f":"IF(填写信息!A229=\"\",\"\",填写信息!C229)","v":""}]
["",{"$f":"IF(AND(填写信息!A229<>\"\",填写信息!A230=\"\"),填写信息!B$3,IF(填写信息!A230<>\"\",填写信息!B$3,\"\"))","v":""},{"$f":"IF(填写信息!A230=\"\",\"\",SUBSTITUTE(SUBSTITUTE(填写信息!A230,\"'\",\"\"),\" \",\"\"))","v":""},null,{"$f":"IF(填写信息!A230=\"\",\"\",填写信息!B230&IF(OR(填写信息!D230=\"\",填写信息!D230=\"FCL\"),\"\",\"拼\"))","v":""},null,{"$f":"IF(填写信息!A230=\"\",\"\",填写信息!C230)","v":""}]
["",{"$f":"IF(AND(填写信息!A230<>\"\",填写信息!A231=\"\"),填写信息!B$3,IF(填写信息!A231<>\"\",填写信息!B$3,\"\"))","v":""},{"$f":"IF(填写信息!A231=\"\",\"\",SUBSTITUTE(SUBSTITUTE(填写信息!A231,\"'\",\"\"),\" \",\"\"))","v":""},null,{"$f":"IF(填写信息!A231=\"\",\"\",填写信息!B231&IF(OR(填写信息!D231=\"\",填写信息!D231=\"FCL\"),\"\",\"拼\"))","v":""},null,{"$f":"IF(填写信息!A231=\"\",\"\",填写信息!C231)","v":""}]
["",{"$f":"IF(AND(填写信息!A231<>\"\",填写信息!A232=\"\"),填写信息!B$3,IF(填写信息!A232<>\"\",填写信息!B$3,\"\"))","v":""},{"$f":"IF(填写信息!A232=\"\",\"\",SUBSTITUTE(SUBSTITUTE(填写信息!A232,\"'\",\"\"),\" \",\"\"))","v":""},null,{"$f":"IF(填写信息!A232=\"\",\"\",填写信息!B232&IF(OR(填写信息!D232=\"\",填写信息!D232=\"FCL\"),\"\",\"拼\"))","v":""},null,{"$f":"IF(填写信息!A232=\"\",\"\",填写信息!C232)","v":""}]
["",{"$f":"IF(AND(填写信息!A232<>\"\",填写信息!A233=\"\"),填写信息!B$3,IF(填写信息!A233<>\"\",填写信息!B$3,\"\"))","v":""},{"$f":"IF(填写信息!A233=\"\",\"\",SUBSTITUTE(SUBSTITUTE(填写信息!A233,\"'\",\"\"),\" \",\"\"))","v":""},null,{"$f":"IF(填写信息!A233=\"\",\"\",填写信息!B233&IF(OR(填写信息!D233=\"\",填写信息!D233=\"FCL\"),\"\",\"拼\"))","v":""},null,{"$f":"IF(填写信息!A233=\"\",\"\",填写信息!C233)","v":""}]
["",{"$f":"IF(AND(填写信息!A233<>\"\",填写信息!A234=\"\"),填写信息!B$3,IF(填写信息!A234<>\"\",填写信息!B$3,\"\"))","v":""},{"$f":"IF(填写信息!A234=\"\",\"\",SUBSTITUTE(SUBSTITUTE(填写信息!A234,\"'\",\"\"),\" \",\"\"))","v":""},null,{"$f":"IF(填写信息!A234=\"\",\"\",填写信息!B234&IF(OR(填写信息!D234=\"\",填写信息!D234=\"FCL\"),\"\",\"拼\"))","v":""},null,{"$f":"IF(填写信息!A234=\"\",\"\",填写信息!C234)","v":""}]
["",{"$f":"IF(AND(填写信息!A234<>\"\",填写信息!A235=\"\"),填写信息!B$3,IF(填写信息!A235<>\"\",填写信息!B$3,\"\"))","v":""},{"$f":"IF(填写信息!A235=\"\",\"\",SUBSTITUTE(SUBSTITUTE(填写信息!A235,\"'\",\"\"),\" \",\"\"))","v":""},null,{"$f":"IF(填写信息!A235=\"\",\"\",填写信息!B235&IF(OR(填写信息!D235=\"\",填写信息!D235=\"FCL\"),\"\",\"拼\"))","v":""},null,{"$f":"IF(填写信息!A235=\"\",\"\",填写信息!C235)","v":""}]
["",{"$f":"IF(AND(填写信息!A235<>\"\",填写信息!A236=\"\"),填写信息!B$3,IF(填写信息!A236<>\"\",填写信息!B$3,\"\"))","v":""},{"$f":"IF(填写信息!A236=\"\",\"\",SUBSTITUTE(SUBSTITUTE(填写信息!A236,\"'\",\"\"),\" \",\"\"))","v":""},null,{"$f":"IF(填写信息!A236=\"\",\"\",填写信息!B236&IF(OR(填写信息!D236=\"\",填写信息!D236=\"FCL\"),\"\",\"拼\"))","v":""},null,{"$f":"IF(填写信息!A236=\"\",\"\",填写信息!C236)","v":""}]
["",{"$f":"IF(AND(填写信息!A236<>\"\",填写信息!A237=\"\"),填写信息!B$3,IF(填写信息!A237<>\"\",填写信息!B$3,\"\"))","v":""},{"$f":"IF(填写信息!A237=\"\",\"\",SUBSTITUTE(SUBSTITUTE(填写信息!A237,\"'\",\"\"),\" \",\"\"))","v":""},null,{"$f":"IF(填写信息!A237=\"\",\"\",填写信息!B237&IF(OR(填写信息!D237=\"\",填写信息!D237=\"FCL\"),\"\",\"拼\"))","v":""},null,{"$f":"IF(填写信息!A237=\"\",\"\",填写信息!C237)","v":""}]
["",{"$f":"IF(AND(填写信息!A237<>\"\",填写信息!A238=\"\"),填写信息!B$3,IF(填写信息!A238<>\"\",填写信息!B$3,\"\"))","v":""},{"$f":"IF(填写信息!A238=\"\",\"\",SUBSTITUTE(SUBSTITUTE(填写信息!A238,\"'\",\"\"),\" \",\"\"))","v":""},null,{"$f":"IF(填写信息!A238=\"\",\"\",填写信息!B238&IF(OR(填写信息!D238=\"\",填写信息!D238=\"FCL\"),\"\",\"拼\"))","v":""},null,{"$f":"IF(填写信息!A238=\"\",\"\",填写信息!C238)","v":""}]
["",{"$f":"IF(AND(填写信息!A238<>\"\",填写信息!A239=\"\"),填写信息!B$3,IF(填写信息!A239<>\"\",填写信息!B$3,\"\"))","v":""},{"$f":"IF(填写信息!A239=\"\",\"\",SUBSTITUTE(SUBSTITUTE(填写信息!A239,\"'\",\"\"),\" \",\"\"))","v":""},null,{"$f":"IF(填写信息!A239=\"\",\"\",填写信息!B239&IF(OR(填写信息!D239=\"\",填写信息!D239=\"FCL\"),\"\",\"拼\"))","v":""},null,{"$f":"IF(填写信息!A239=\"\",\"\",填写信息!C239)","v":""}]
["",{"$f":"IF(AND(填写信息!A239<>\"\",填写信息!A240=\"\"),填写信息!B$3,IF(填写信息!A240<>\"\",填写信息!B$3,\"\"))","v":""},{"$f":"IF(填写信息!A240=\"\",\"\",SUBSTITUTE(SUBSTITUTE(填写信息!A240,\"'\",\"\"),\" \",\"\"))","v":""},null,{"$f":"IF(填写信息!A240=\"\",\"\",填写信息!B240&IF(OR(填写信息!D240=\"\",填写信息!D240=\"FCL\"),\"\",\"拼\"))","v":""},null,{"$f":"IF(填写信息!A240=\"\",\"\",填写信息!C240)","v":""}]
["",{"$f":"IF(AND(填写信息!A240<>\"\",填写信息!A241=\"\"),填写信息!B$3,IF(填写信息!A241<>\"\",填写信息!B$3,\"\"))","v":""},{"$f":"IF(填写信息!A241=\"\",\"\",SUBSTITUTE(SUBSTITUTE(填写信息!A241,\"'\",\"\"),\" \",\"\"))","v":""},null,{"$f":"IF(填写信息!A241=\"\",\"\",填写信息!B241&IF(OR(填写信息!D241=\"\",填写信息!D241=\"FCL\"),\"\",\"拼\"))","v":""},null,{"$f":"IF(填写信息!A241=\"\",\"\",填写信息!C241)","v":""}]
["",{"$f":"IF(AND(填写信息!A241<>\"\",填写信息!A242=\"\"),填写信息!B$3,IF(填写信息!A242<>\"\",填写信息!B$3,\"\"))","v":""},{"$f":"IF(填写信息!A242=\"\",\"\",SUBSTITUTE(SUBSTITUTE(填写信息!A242,\"'\",\"\"),\" \",\"\"))","v":""},null,{"$f":"IF(填写信息!A242=\"\",\"\",填写信息!B242&IF(OR(填写信息!D242=\"\",填写信息!D242=\"FCL\"),\"\",\"拼\"))","v":""},null,{"$f":"IF(填写信息!A242=\"\",\"\",填写信息!C242)","v":""}]
["",{"$f":"IF(AND(填写信息!A242<>\"\",填写信息!A243=\"\"),填写信息!B$3,IF(填写信息!A243<>\"\",填写信息!B$3,\"\"))","v":""},{"$f":"IF(填写信息!A243=\"\",\"\",SUBSTITUTE(SUBSTITUTE(填写信息!A243,\"'\",\"\"),\" \",\"\"))","v":""},null,{"$f":"IF(填写信息!A243=\"\",\"\",填写信息!B243&IF(OR(填写信息!D243=\"\",填写信息!D243=\"FCL\"),\"\",\"拼\"))","v":""},null,{"$f":"IF(填写信息!A243=\"\",\"\",填写信息!C243)","v":""}]
["",{"$f":"IF(AND(填写信息!A243<>\"\",填写信息!A244=\"\"),填写信息!B$3,IF(填写信息!A244<>\"\",填写信息!B$3,\"\"))","v":""},{"$f":"IF(填写信息!A244=\"\",\"\",SUBSTITUTE(SUBSTITUTE(填写信息!A244,\"'\",\"\"),\" \",\"\"))","v":""},null,{"$f":"IF(填写信息!A244=\"\",\"\",填写信息!B244&IF(OR(填写信息!D244=\"\",填写信息!D244=\"FCL\"),\"\",\"拼\"))","v":""},null,{"$f":"IF(填写信息!A244=\"\",\"\",填写信息!C244)","v":""}]

{"sheet":"纸质舱单","index":6,"n_rows":143,"n_cols":34,"rows_kept":143,"cut":false,"hidden":false,"merged":[]}
["         集装箱号/封号/柜型",null,null,"       提单号","报关单号","                  货名",null,"温度","件数","包装","毛重","收货人","目的港","             发货人",null,null,"报关单编号","发货人国家","发货人名称","发货人代码","发货人地址","发货人电话","发货人联系人","收货人国家","收货人名称","收货人代码","收货人电话","收货人地址","收货人联系人","危险品编号","货物描述","件数","包装","毛重"]
[{"$f":"IF(TRIM(填写信息!A97)=\"\",\"\",填写信息!A97&\"/\"&填写信息!B97&\"/\"&填写信息!C97&\"/\"&填写信息!D97)","v":"ABCD1234560/EMCABC0001/40HQ/FCL"},null,null,{"$f":"填写信息!B3","v":"156000888887"},"",{"$f":"填写信息!B26","v":"测试货名1"},null,{"$f":"填写信息!B86&\"\"","v":""},{"$f":"填写信息!J23","v":1000},{"$f":"填写信息!J25","v":"件"},{"$f":"填写信息!J24","v":28800},{"$f":"填写信息!B14","v":"BBC CO.LTD"},{"$f":"填写信息!B23&\", /\"&填写信息!M22","v":"ABCPORT, /JP"},{"$f":"填写信息!B6","v":"BBBB有限公司"},null,null,null,{"$f":"填写信息!K3","v":"CN"},{"$f":"填写信息!B6","v":"BBBB有限公司"},{"$f":"填写信息!B7","v":"91440XXXXXXXXXXXXX"},{"$f":"填写信息!B8","v":"广东省湛江市xxx区xxx街道888号"},{"$f":"填写信息!B9","v":"1380975XXXX"},{"$f":"填写信息!B10","v":"SOMEBODY"},{"$f":"填写信息!K10","v":"GB"},{"$f":"填写信息!B14","v":"BBC CO.LTD"},{"$f":"填写信息!B15","v":"80808XXXXXXX"},{"$f":"填写信息!B17","v":"886-886-886"},{"$f":"填写信息!B16","v":"COUNTRY.STATE.CITY.DISTRICT.001"},{"$f":"填写信息!B18","v":"SOMEBODY"},{"$f":"填写信息!B87&\"\"","v":""},{"$f":"填写信息!B26&\"\"","v":"测试货名1"},{"$f":"填写信息!C26&\"\"","v":"100"},{"$f":"填写信息!D26&\"\"","v":"CTNS"},{"$f":"ROUND(填写信息!E26,3)","v":18000}]
[{"$f":"IF(TRIM(填写信息!A98)=\"\",\"\",填写信息!A98&\"/\"&填写信息!B98&\"/\"&填写信息!C98&\"/\"&填写信息!D98)","v":""},{"$nulls":29},{"$f":"填写信息!B27&\"\"","v":"测试货名2"},{"$f":"填写信息!C27&\"\"","v":"100"},{"$f":"填写信息!D27&\"\"","v":"PACKAGES"},{"$f":"ROUND(填写信息!E27,3)","v":1200}]
[{"$f":"IF(TRIM(填写信息!A99)=\"\",\"\",填写信息!A99&\"/\"&填写信息!B99&\"/\"&填写信息!C99&\"/\"&填写信息!D99)","v":""},{"$nulls":29},{"$f":"填写信息!B28&\"\"","v":"测试货名3"},{"$f":"填写信息!C28&\"\"","v":"100"},{"$f":"填写信息!D28&\"\"","v":"REEL"},{"$f":"ROUND(填写信息!E28,3)","v":1200}]
[{"$f":"IF(TRIM(填写信息!A100)=\"\",\"\",填写信息!A100&\"/\"&填写信息!B100&\"/\"&填写信息!C100&\"/\"&填写信息!D100)","v":""},{"$nulls":29},{"$f":"填写信息!B29&\"\"","v":"测试货名4"},{"$f":"填写信息!C29&\"\"","v":"100"},{"$f":"填写信息!D29&\"\"","v":"BAGS"},{"$f":"ROUND(填写信息!E29,3)","v":1200}]
[{"$f":"IF(TRIM(填写信息!A101)=\"\",\"\",填写信息!A101&\"/\"&填写信息!B101&\"/\"&填写信息!C101&\"/\"&填写信息!D101)","v":""},{"$nulls":29},{"$f":"填写信息!B30&\"\"","v":"测试货名5"},{"$f":"填写信息!C30&\"\"","v":"100"},{"$f":"填写信息!D30&\"\"","v":"BRAID"},{"$f":"ROUND(填写信息!E30,3)","v":1200}]
[{"$f":"IF(TRIM(填写信息!A102)=\"\",\"\",填写信息!A102&\"/\"&填写信息!B102&\"/\"&填写信息!C102&\"/\"&填写信息!D102)","v":""},{"$nulls":29},{"$f":"填写信息!B31&\"\"","v":"测试货名6"},{"$f":"填写信息!C31&\"\"","v":"100"},{"$f":"填写信息!D31&\"\"","v":"BAGS"},{"$f":"ROUND(填写信息!E31,3)","v":1200}]
[{"$f":"IF(TRIM(填写信息!A103)=\"\",\"\",填写信息!A103&\"/\"&填写信息!B103&\"/\"&填写信息!C103&\"/\"&填写信息!D103)","v":""},{"$nulls":29},{"$f":"填写信息!B32&\"\"","v":"测试货名7"},{"$f":"填写信息!C32&\"\"","v":"100"},{"$f":"填写信息!D32&\"\"","v":"BAGS"},{"$f":"ROUND(填写信息!E32,3)","v":1200}]
[{"$f":"IF(TRIM(填写信息!A104)=\"\",\"\",填写信息!A104&\"/\"&填写信息!B104&\"/\"&填写信息!C104&\"/\"&填写信息!D104)","v":""},{"$nulls":29},{"$f":"填写信息!B33&\"\"","v":"测试货名8"},{"$f":"填写信息!C33&\"\"","v":"100"},{"$f":"填写信息!D33&\"\"","v":"BAGS"},{"$f":"ROUND(填写信息!E33,3)","v":1200}]
[{"$f":"IF(TRIM(填写信息!A105)=\"\",\"\",填写信息!A105&\"/\"&填写信息!B105&\"/\"&填写信息!C105&\"/\"&填写信息!D105)","v":""},{"$nulls":29},{"$f":"填写信息!B34&\"\"","v":"测试货名9"},{"$f":"填写信息!C34&\"\"","v":"100"},{"$f":"填写信息!D34&\"\"","v":"BAGS"},{"$f":"ROUND(填写信息!E34,3)","v":1200}]
[{"$f":"IF(TRIM(填写信息!A106)=\"\",\"\",填写信息!A106&\"/\"&填写信息!B106&\"/\"&填写信息!C106&\"/\"&填写信息!D106)","v":""},{"$nulls":29},{"$f":"填写信息!B35&\"\"","v":"测试货名10"},{"$f":"填写信息!C35&\"\"","v":"100"},{"$f":"填写信息!D35&\"\"","v":"BAGS"},{"$f":"ROUND(填写信息!E35,3)","v":1200}]
[{"$f":"IF(TRIM(填写信息!A107)=\"\",\"\",填写信息!A107&\"/\"&填写信息!B107&\"/\"&填写信息!C107&\"/\"&填写信息!D107)","v":""},{"$nulls":29},{"$f":"填写信息!B36&\"\"","v":""},{"$f":"填写信息!C36&\"\"","v":""},{"$f":"填写信息!D36&\"\"","v":""},{"$f":"ROUND(填写信息!E36,3)","v":0}]
[{"$f":"IF(TRIM(填写信息!A108)=\"\",\"\",填写信息!A108&\"/\"&填写信息!B108&\"/\"&填写信息!C108&\"/\"&填写信息!D108)","v":""},{"$nulls":29},{"$f":"填写信息!B37&\"\"","v":""},{"$f":"填写信息!C37&\"\"","v":""},{"$f":"填写信息!D37&\"\"","v":""},{"$f":"ROUND(填写信息!E37,3)","v":0}]
[{"$f":"IF(TRIM(填写信息!A109)=\"\",\"\",填写信息!A109&\"/\"&填写信息!B109&\"/\"&填写信息!C109&\"/\"&填写信息!D109)","v":""},{"$nulls":29},{"$f":"填写信息!B38&\"\"","v":""},{"$f":"填写信息!C38&\"\"","v":""},{"$f":"填写信息!D38&\"\"","v":""},{"$f":"ROUND(填写信息!E38,3)","v":0}]
[{"$f":"IF(TRIM(填写信息!A110)=\"\",\"\",填写信息!A110&\"/\"&填写信息!B110&\"/\"&填写信息!C110&\"/\"&填写信息!D110)","v":""},{"$nulls":29},{"$f":"填写信息!B39&\"\"","v":""},{"$f":"填写信息!C39&\"\"","v":""},{"$f":"填写信息!D39&\"\"","v":""},{"$f":"ROUND(填写信息!E39,3)","v":0}]
[{"$f":"IF(TRIM(填写信息!A111)=\"\",\"\",填写信息!A111&\"/\"&填写信息!B111&\"/\"&填写信息!C111&\"/\"&填写信息!D111)","v":""},{"$nulls":29},{"$f":"填写信息!B40&\"\"","v":""},{"$f":"填写信息!C40&\"\"","v":""},{"$f":"填写信息!D40&\"\"","v":""},{"$f":"ROUND(填写信息!E40,3)","v":0}]
[{"$f":"IF(TRIM(填写信息!A112)=\"\",\"\",填写信息!A112&\"/\"&填写信息!B112&\"/\"&填写信息!C112&\"/\"&填写信息!D112)","v":""},{"$nulls":29},{"$f":"填写信息!B41&\"\"","v":""},{"$f":"填写信息!C41&\"\"","v":""},{"$f":"填写信息!D41&\"\"","v":""},{"$f":"ROUND(填写信息!E41,3)","v":0}]
[{"$f":"IF(TRIM(填写信息!A113)=\"\",\"\",填写信息!A113&\"/\"&填写信息!B113&\"/\"&填写信息!C113&\"/\"&填写信息!D113)","v":""},{"$nulls":29},{"$f":"填写信息!B42&\"\"","v":""},{"$f":"填写信息!C42&\"\"","v":""},{"$f":"填写信息!D42&\"\"","v":""},{"$f":"ROUND(填写信息!E42,3)","v":0}]
[{"$f":"IF(TRIM(填写信息!A114)=\"\",\"\",填写信息!A114&\"/\"&填写信息!B114&\"/\"&填写信息!C114&\"/\"&填写信息!D114)","v":""},{"$nulls":29},{"$f":"填写信息!B43&\"\"","v":""},{"$f":"填写信息!C43&\"\"","v":""},{"$f":"填写信息!D43&\"\"","v":""},{"$f":"ROUND(填写信息!E43,3)","v":0}]
[{"$f":"IF(TRIM(填写信息!A115)=\"\",\"\",填写信息!A115&\"/\"&填写信息!B115&\"/\"&填写信息!C115&\"/\"&填写信息!D115)","v":""},{"$nulls":29},{"$f":"填写信息!B44&\"\"","v":""},{"$f":"填写信息!C44&\"\"","v":""},{"$f":"填写信息!D44&\"\"","v":""},{"$f":"ROUND(填写信息!E44,3)","v":0}]
[{"$f":"IF(TRIM(填写信息!A116)=\"\",\"\",填写信息!A116&\"/\"&填写信息!B116&\"/\"&填写信息!C116&\"/\"&填写信息!D116)","v":""},{"$nulls":29},{"$f":"填写信息!B45&\"\"","v":""},{"$f":"填写信息!C45&\"\"","v":""},{"$f":"填写信息!D45&\"\"","v":""},{"$f":"ROUND(填写信息!E45,3)","v":0}]
[{"$f":"IF(TRIM(填写信息!A117)=\"\",\"\",填写信息!A117&\"/\"&填写信息!B117&\"/\"&填写信息!C117&\"/\"&填写信息!D117)","v":""},{"$nulls":29},{"$f":"填写信息!B46&\"\"","v":""},{"$f":"填写信息!C46&\"\"","v":""},{"$f":"填写信息!D46&\"\"","v":""},{"$f":"ROUND(填写信息!E46,3)","v":0}]
[{"$f":"IF(TRIM(填写信息!A118)=\"\",\"\",填写信息!A118&\"/\"&填写信息!B118&\"/\"&填写信息!C118&\"/\"&填写信息!D118)","v":""},{"$nulls":29},{"$f":"填写信息!B47&\"\"","v":""},{"$f":"填写信息!C47&\"\"","v":""},{"$f":"填写信息!D47&\"\"","v":""},{"$f":"ROUND(填写信息!E47,3)","v":0}]
[{"$f":"IF(TRIM(填写信息!A119)=\"\",\"\",填写信息!A119&\"/\"&填写信息!B119&\"/\"&填写信息!C119&\"/\"&填写信息!D119)","v":""},{"$nulls":29},{"$f":"填写信息!B48&\"\"","v":""},{"$f":"填写信息!C48&\"\"","v":""},{"$f":"填写信息!D48&\"\"","v":""},{"$f":"ROUND(填写信息!E48,3)","v":0}]
[{"$f":"IF(TRIM(填写信息!A120)=\"\",\"\",填写信息!A120&\"/\"&填写信息!B120&\"/\"&填写信息!C120&\"/\"&填写信息!D120)","v":""},{"$nulls":29},{"$f":"填写信息!B49&\"\"","v":""},{"$f":"填写信息!C49&\"\"","v":""},{"$f":"填写信息!D49&\"\"","v":""},{"$f":"ROUND(填写信息!E49,3)","v":0}]
[{"$f":"IF(TRIM(填写信息!A121)=\"\",\"\",填写信息!A121&\"/\"&填写信息!B121&\"/\"&填写信息!C121&\"/\"&填写信息!D121)","v":""},{"$nulls":29},{"$f":"填写信息!B50&\"\"","v":""},{"$f":"填写信息!C50&\"\"","v":""},{"$f":"填写信息!D50&\"\"","v":""},{"$f":"ROUND(填写信息!E50,3)","v":0}]
[{"$f":"IF(TRIM(填写信息!A122)=\"\",\"\",填写信息!A122&\"/\"&填写信息!B122&\"/\"&填写信息!C122&\"/\"&填写信息!D122)","v":""},{"$nulls":29},{"$f":"填写信息!B51&\"\"","v":""},{"$f":"填写信息!C51&\"\"","v":""},{"$f":"填写信息!D51&\"\"","v":""},{"$f":"ROUND(填写信息!E51,3)","v":0}]
[{"$f":"IF(TRIM(填写信息!A123)=\"\",\"\",填写信息!A123&\"/\"&填写信息!B123&\"/\"&填写信息!C123&\"/\"&填写信息!D123)","v":""},{"$nulls":29},{"$f":"填写信息!B52&\"\"","v":""},{"$f":"填写信息!C52&\"\"","v":""},{"$f":"填写信息!D52&\"\"","v":""},{"$f":"ROUND(填写信息!E52,3)","v":0}]
[{"$f":"IF(TRIM(填写信息!A124)=\"\",\"\",填写信息!A124&\"/\"&填写信息!B124&\"/\"&填写信息!C124&\"/\"&填写信息!D124)","v":""},{"$nulls":29},{"$f":"填写信息!B53&\"\"","v":""},{"$f":"填写信息!C53&\"\"","v":""},{"$f":"填写信息!D53&\"\"","v":""},{"$f":"ROUND(填写信息!E53,3)","v":0}]
[{"$f":"IF(TRIM(填写信息!A125)=\"\",\"\",填写信息!A125&\"/\"&填写信息!B125&\"/\"&填写信息!C125&\"/\"&填写信息!D125)","v":""},{"$nulls":29},{"$f":"填写信息!B54&\"\"","v":""},{"$f":"填写信息!C54&\"\"","v":""},{"$f":"填写信息!D54&\"\"","v":""},{"$f":"ROUND(填写信息!E54,3)","v":0}]
[{"$f":"IF(TRIM(填写信息!A126)=\"\",\"\",填写信息!A126&\"/\"&填写信息!B126&\"/\"&填写信息!C126&\"/\"&填写信息!D126)","v":""},{"$nulls":29},{"$f":"填写信息!B55&\"\"","v":""},{"$f":"填写信息!C55&\"\"","v":""},{"$f":"填写信息!D55&\"\"","v":""},{"$f":"ROUND(填写信息!E55,3)","v":0}]
[{"$f":"IF(TRIM(填写信息!A127)=\"\",\"\",填写信息!A127&\"/\"&填写信息!B127&\"/\"&填写信息!C127&\"/\"&填写信息!D127)","v":""},{"$nulls":29},{"$f":"填写信息!B56&\"\"","v":""},{"$f":"填写信息!C56&\"\"","v":""},{"$f":"填写信息!D56&\"\"","v":""},{"$f":"ROUND(填写信息!E56,3)","v":0}]
[{"$f":"IF(TRIM(填写信息!A128)=\"\",\"\",填写信息!A128&\"/\"&填写信息!B128&\"/\"&填写信息!C128&\"/\"&填写信息!D128)","v":""},{"$nulls":29},{"$f":"填写信息!B57&\"\"","v":""},{"$f":"填写信息!C57&\"\"","v":""},{"$f":"填写信息!D57&\"\"","v":""},{"$f":"ROUND(填写信息!E57,3)","v":0}]
[{"$f":"IF(TRIM(填写信息!A129)=\"\",\"\",填写信息!A129&\"/\"&填写信息!B129&\"/\"&填写信息!C129&\"/\"&填写信息!D129)","v":""},{"$nulls":29},{"$f":"填写信息!B58&\"\"","v":""},{"$f":"填写信息!C58&\"\"","v":""},{"$f":"填写信息!D58&\"\"","v":""},{"$f":"ROUND(填写信息!E58,3)","v":0}]
[{"$f":"IF(TRIM(填写信息!A130)=\"\",\"\",填写信息!A130&\"/\"&填写信息!B130&\"/\"&填写信息!C130&\"/\"&填写信息!D130)","v":""},{"$nulls":29},{"$f":"填写信息!B59&\"\"","v":""},{"$f":"填写信息!C59&\"\"","v":""},{"$f":"填写信息!D59&\"\"","v":""},{"$f":"ROUND(填写信息!E59,3)","v":0}]
[{"$f":"IF(TRIM(填写信息!A131)=\"\",\"\",填写信息!A131&\"/\"&填写信息!B131&\"/\"&填写信息!C131&\"/\"&填写信息!D131)","v":""},{"$nulls":29},{"$f":"填写信息!B60&\"\"","v":""},{"$f":"填写信息!C60&\"\"","v":""},{"$f":"填写信息!D60&\"\"","v":""},{"$f":"ROUND(填写信息!E60,3)","v":0}]
[{"$f":"IF(TRIM(填写信息!A132)=\"\",\"\",填写信息!A132&\"/\"&填写信息!B132&\"/\"&填写信息!C132&\"/\"&填写信息!D132)","v":""},{"$nulls":29},{"$f":"填写信息!B61&\"\"","v":""},{"$f":"填写信息!C61&\"\"","v":""},{"$f":"填写信息!D61&\"\"","v":""},{"$f":"ROUND(填写信息!E61,3)","v":0}]
[{"$f":"IF(TRIM(填写信息!A133)=\"\",\"\",填写信息!A133&\"/\"&填写信息!B133&\"/\"&填写信息!C133&\"/\"&填写信息!D133)","v":""},{"$nulls":29},{"$f":"填写信息!B62&\"\"","v":""},{"$f":"填写信息!C62&\"\"","v":""},{"$f":"填写信息!D62&\"\"","v":""},{"$f":"ROUND(填写信息!E62,3)","v":0}]
[{"$f":"IF(TRIM(填写信息!A134)=\"\",\"\",填写信息!A134&\"/\"&填写信息!B134&\"/\"&填写信息!C134&\"/\"&填写信息!D134)","v":""},{"$nulls":29},{"$f":"填写信息!B63&\"\"","v":""},{"$f":"填写信息!C63&\"\"","v":""},{"$f":"填写信息!D63&\"\"","v":""},{"$f":"ROUND(填写信息!E63,3)","v":0}]
[{"$f":"IF(TRIM(填写信息!A135)=\"\",\"\",填写信息!A135&\"/\"&填写信息!B135&\"/\"&填写信息!C135&\"/\"&填写信息!D135)","v":""},{"$nulls":29},{"$f":"填写信息!B64&\"\"","v":""},{"$f":"填写信息!C64&\"\"","v":""},{"$f":"填写信息!D64&\"\"","v":""},{"$f":"ROUND(填写信息!E64,3)","v":0}]
[{"$f":"IF(TRIM(填写信息!A136)=\"\",\"\",填写信息!A136&\"/\"&填写信息!B136&\"/\"&填写信息!C136&\"/\"&填写信息!D136)","v":""},{"$nulls":29},{"$f":"填写信息!B65&\"\"","v":""},{"$f":"填写信息!C65&\"\"","v":""},{"$f":"填写信息!D65&\"\"","v":""},{"$f":"ROUND(填写信息!E65,3)","v":0}]
[{"$f":"IF(TRIM(填写信息!A137)=\"\",\"\",填写信息!A137&\"/\"&填写信息!B137&\"/\"&填写信息!C137&\"/\"&填写信息!D137)","v":""},{"$nulls":29},{"$f":"填写信息!B66&\"\"","v":""},{"$f":"填写信息!C66&\"\"","v":""},{"$f":"填写信息!D66&\"\"","v":""},{"$f":"ROUND(填写信息!E66,3)","v":0}]
[{"$f":"IF(TRIM(填写信息!A138)=\"\",\"\",填写信息!A138&\"/\"&填写信息!B138&\"/\"&填写信息!C138&\"/\"&填写信息!D138)","v":""},{"$nulls":29},{"$f":"填写信息!B67&\"\"","v":""},{"$f":"填写信息!C67&\"\"","v":""},{"$f":"填写信息!D67&\"\"","v":""},{"$f":"ROUND(填写信息!E67,3)","v":0}]
[{"$f":"IF(TRIM(填写信息!A139)=\"\",\"\",填写信息!A139&\"/\"&填写信息!B139&\"/\"&填写信息!C139&\"/\"&填写信息!D139)","v":""},{"$nulls":29},{"$f":"填写信息!B68&\"\"","v":""},{"$f":"填写信息!C68&\"\"","v":""},{"$f":"填写信息!D68&\"\"","v":""},{"$f":"ROUND(填写信息!E68,3)","v":0}]
[{"$f":"IF(TRIM(填写信息!A140)=\"\",\"\",填写信息!A140&\"/\"&填写信息!B140&\"/\"&填写信息!C140&\"/\"&填写信息!D140)","v":""},{"$nulls":29},{"$f":"填写信息!B69&\"\"","v":""},{"$f":"填写信息!C69&\"\"","v":""},{"$f":"填写信息!D69&\"\"","v":""},{"$f":"ROUND(填写信息!E69,3)","v":0}]
[{"$f":"IF(TRIM(填写信息!A141)=\"\",\"\",填写信息!A141&\"/\"&填写信息!B141&\"/\"&填写信息!C141&\"/\"&填写信息!D141)","v":""},{"$nulls":29},{"$f":"填写信息!B70&\"\"","v":""},{"$f":"填写信息!C70&\"\"","v":""},{"$f":"填写信息!D70&\"\"","v":""},{"$f":"ROUND(填写信息!E70,3)","v":0}]
[{"$f":"IF(TRIM(填写信息!A142)=\"\",\"\",填写信息!A142&\"/\"&填写信息!B142&\"/\"&填写信息!C142&\"/\"&填写信息!D142)","v":""},{"$nulls":29},{"$f":"填写信息!B71&\"\"","v":""},{"$f":"填写信息!C71&\"\"","v":""},{"$f":"填写信息!D71&\"\"","v":""},{"$f":"ROUND(填写信息!E71,3)","v":0}]
[{"$f":"IF(TRIM(填写信息!A143)=\"\",\"\",填写信息!A143&\"/\"&填写信息!B143&\"/\"&填写信息!C143&\"/\"&填写信息!D143)","v":""},{"$nulls":29},{"$f":"填写信息!B72&\"\"","v":""},{"$f":"填写信息!C72&\"\"","v":""},{"$f":"填写信息!D72&\"\"","v":""},{"$f":"ROUND(填写信息!E72,3)","v":0}]
[{"$f":"IF(TRIM(填写信息!A144)=\"\",\"\",填写信息!A144&\"/\"&填写信息!B144&\"/\"&填写信息!C144&\"/\"&填写信息!D144)","v":""},{"$nulls":29},{"$f":"填写信息!B73&\"\"","v":""},{"$f":"填写信息!C73&\"\"","v":""},{"$f":"填写信息!D73&\"\"","v":""},{"$f":"ROUND(填写信息!E73,3)","v":0}]
[{"$f":"IF(TRIM(填写信息!A145)=\"\",\"\",填写信息!A145&\"/\"&填写信息!B145&\"/\"&填写信息!C145&\"/\"&填写信息!D145)","v":""},{"$nulls":29},{"$f":"填写信息!B74&\"\"","v":""},{"$f":"填写信息!C74&\"\"","v":""},{"$f":"填写信息!D74&\"\"","v":""},{"$f":"ROUND(填写信息!E74,3)","v":0}]
[{"$f":"IF(TRIM(填写信息!A146)=\"\",\"\",填写信息!A146&\"/\"&填写信息!B146&\"/\"&填写信息!C146&\"/\"&填写信息!D146)","v":""},{"$nulls":29},{"$f":"填写信息!B75&\"\"","v":""},{"$f":"填写信息!C75&\"\"","v":""},{"$f":"填写信息!D75&\"\"","v":""},{"$f":"ROUND(填写信息!E75,3)","v":0}]
[{"$f":"IF(TRIM(填写信息!A147)=\"\",\"\",填写信息!A147&\"/\"&填写信息!B147&\"/\"&填写信息!C147&\"/\"&填写信息!D147)","v":""}]
[{"$f":"IF(TRIM(填写信息!A148)=\"\",\"\",填写信息!A148&\"/\"&填写信息!B148&\"/\"&填写信息!C148&\"/\"&填写信息!D148)","v":""}]
[{"$f":"IF(TRIM(填写信息!A149)=\"\",\"\",填写信息!A149&\"/\"&填写信息!B149&\"/\"&填写信息!C149&\"/\"&填写信息!D149)","v":""}]
[{"$f":"IF(TRIM(填写信息!A150)=\"\",\"\",填写信息!A150&\"/\"&填写信息!B150&\"/\"&填写信息!C150&\"/\"&填写信息!D150)","v":""}]
[{"$f":"IF(TRIM(填写信息!A151)=\"\",\"\",填写信息!A151&\"/\"&填写信息!B151&\"/\"&填写信息!C151&\"/\"&填写信息!D151)","v":""}]
[{"$f":"IF(TRIM(填写信息!A152)=\"\",\"\",填写信息!A152&\"/\"&填写信息!B152&\"/\"&填写信息!C152&\"/\"&填写信息!D152)","v":""}]
[{"$f":"IF(TRIM(填写信息!A153)=\"\",\"\",填写信息!A153&\"/\"&填写信息!B153&\"/\"&填写信息!C153&\"/\"&填写信息!D153)","v":""}]
[{"$f":"IF(TRIM(填写信息!A154)=\"\",\"\",填写信息!A154&\"/\"&填写信息!B154&\"/\"&填写信息!C154&\"/\"&填写信息!D154)","v":""}]
[{"$f":"IF(TRIM(填写信息!A155)=\"\",\"\",填写信息!A155&\"/\"&填写信息!B155&\"/\"&填写信息!C155&\"/\"&填写信息!D155)","v":""}]
[{"$f":"IF(TRIM(填写信息!A156)=\"\",\"\",填写信息!A156&\"/\"&填写信息!B156&\"/\"&填写信息!C156&\"/\"&填写信息!D156)","v":""}]
[{"$f":"IF(TRIM(填写信息!A157)=\"\",\"\",填写信息!A157&\"/\"&填写信息!B157&\"/\"&填写信息!C157&\"/\"&填写信息!D157)","v":""}]
[{"$f":"IF(TRIM(填写信息!A158)=\"\",\"\",填写信息!A158&\"/\"&填写信息!B158&\"/\"&填写信息!C158&\"/\"&填写信息!D158)","v":""}]
[{"$f":"IF(TRIM(填写信息!A159)=\"\",\"\",填写信息!A159&\"/\"&填写信息!B159&\"/\"&填写信息!C159&\"/\"&填写信息!D159)","v":""}]
[{"$f":"IF(TRIM(填写信息!A160)=\"\",\"\",填写信息!A160&\"/\"&填写信息!B160&\"/\"&填写信息!C160&\"/\"&填写信息!D160)","v":""}]
[{"$f":"IF(TRIM(填写信息!A161)=\"\",\"\",填写信息!A161&\"/\"&填写信息!B161&\"/\"&填写信息!C161&\"/\"&填写信息!D161)","v":""}]
[{"$f":"IF(TRIM(填写信息!A162)=\"\",\"\",填写信息!A162&\"/\"&填写信息!B162&\"/\"&填写信息!C162&\"/\"&填写信息!D162)","v":""}]
[{"$f":"IF(TRIM(填写信息!A163)=\"\",\"\",填写信息!A163&\"/\"&填写信息!B163&\"/\"&填写信息!C163&\"/\"&填写信息!D163)","v":""}]
[{"$f":"IF(TRIM(填写信息!A164)=\"\",\"\",填写信息!A164&\"/\"&填写信息!B164&\"/\"&填写信息!C164&\"/\"&填写信息!D164)","v":""}]
[{"$f":"IF(TRIM(填写信息!A165)=\"\",\"\",填写信息!A165&\"/\"&填写信息!B165&\"/\"&填写信息!C165&\"/\"&填写信息!D165)","v":""}]
[{"$f":"IF(TRIM(填写信息!A166)=\"\",\"\",填写信息!A166&\"/\"&填写信息!B166&\"/\"&填写信息!C166&\"/\"&填写信息!D166)","v":""}]
[{"$f":"IF(TRIM(填写信息!A167)=\"\",\"\",填写信息!A167&\"/\"&填写信息!B167&\"/\"&填写信息!C167&\"/\"&填写信息!D167)","v":""}]
[{"$f":"IF(TRIM(填写信息!A168)=\"\",\"\",填写信息!A168&\"/\"&填写信息!B168&\"/\"&填写信息!C168&\"/\"&填写信息!D168)","v":""}]
[{"$f":"IF(TRIM(填写信息!A169)=\"\",\"\",填写信息!A169&\"/\"&填写信息!B169&\"/\"&填写信息!C169&\"/\"&填写信息!D169)","v":""}]
[{"$f":"IF(TRIM(填写信息!A170)=\"\",\"\",填写信息!A170&\"/\"&填写信息!B170&\"/\"&填写信息!C170&\"/\"&填写信息!D170)","v":""}]
[{"$f":"IF(TRIM(填写信息!A171)=\"\",\"\",填写信息!A171&\"/\"&填写信息!B171&\"/\"&填写信息!C171&\"/\"&填写信息!D171)","v":""}]
[{"$f":"IF(TRIM(填写信息!A172)=\"\",\"\",填写信息!A172&\"/\"&填写信息!B172&\"/\"&填写信息!C172&\"/\"&填写信息!D172)","v":""}]
[{"$f":"IF(TRIM(填写信息!A173)=\"\",\"\",填写信息!A173&\"/\"&填写信息!B173&\"/\"&填写信息!C173&\"/\"&填写信息!D173)","v":""}]
[{"$f":"IF(TRIM(填写信息!A174)=\"\",\"\",填写信息!A174&\"/\"&填写信息!B174&\"/\"&填写信息!C174&\"/\"&填写信息!D174)","v":""}]
[{"$f":"IF(TRIM(填写信息!A175)=\"\",\"\",填写信息!A175&\"/\"&填写信息!B175&\"/\"&填写信息!C175&\"/\"&填写信息!D175)","v":""}]
[{"$f":"IF(TRIM(填写信息!A176)=\"\",\"\",填写信息!A176&\"/\"&填写信息!B176&\"/\"&填写信息!C176&\"/\"&填写信息!D176)","v":""}]
[{"$f":"IF(TRIM(填写信息!A177)=\"\",\"\",填写信息!A177&\"/\"&填写信息!B177&\"/\"&填写信息!C177&\"/\"&填写信息!D177)","v":""}]
[{"$f":"IF(TRIM(填写信息!A178)=\"\",\"\",填写信息!A178&\"/\"&填写信息!B178&\"/\"&填写信息!C178&\"/\"&填写信息!D178)","v":""}]
[{"$f":"IF(TRIM(填写信息!A179)=\"\",\"\",填写信息!A179&\"/\"&填写信息!B179&\"/\"&填写信息!C179&\"/\"&填写信息!D179)","v":""}]
[{"$f":"IF(TRIM(填写信息!A180)=\"\",\"\",填写信息!A180&\"/\"&填写信息!B180&\"/\"&填写信息!C180&\"/\"&填写信息!D180)","v":""}]
[{"$f":"IF(TRIM(填写信息!A181)=\"\",\"\",填写信息!A181&\"/\"&填写信息!B181&\"/\"&填写信息!C181&\"/\"&填写信息!D181)","v":""}]
[{"$f":"IF(TRIM(填写信息!A182)=\"\",\"\",填写信息!A182&\"/\"&填写信息!B182&\"/\"&填写信息!C182&\"/\"&填写信息!D182)","v":""}]
[{"$f":"IF(TRIM(填写信息!A183)=\"\",\"\",填写信息!A183&\"/\"&填写信息!B183&\"/\"&填写信息!C183&\"/\"&填写信息!D183)","v":""}]
[{"$f":"IF(TRIM(填写信息!A184)=\"\",\"\",填写信息!A184&\"/\"&填写信息!B184&\"/\"&填写信息!C184&\"/\"&填写信息!D184)","v":""}]
[{"$f":"IF(TRIM(填写信息!A185)=\"\",\"\",填写信息!A185&\"/\"&填写信息!B185&\"/\"&填写信息!C185&\"/\"&填写信息!D185)","v":""}]
[{"$f":"IF(TRIM(填写信息!A186)=\"\",\"\",填写信息!A186&\"/\"&填写信息!B186&\"/\"&填写信息!C186&\"/\"&填写信息!D186)","v":""}]
[{"$f":"IF(TRIM(填写信息!A187)=\"\",\"\",填写信息!A187&\"/\"&填写信息!B187&\"/\"&填写信息!C187&\"/\"&填写信息!D187)","v":""}]
[{"$f":"IF(TRIM(填写信息!A188)=\"\",\"\",填写信息!A188&\"/\"&填写信息!B188&\"/\"&填写信息!C188&\"/\"&填写信息!D188)","v":""}]
[{"$f":"IF(TRIM(填写信息!A189)=\"\",\"\",填写信息!A189&\"/\"&填写信息!B189&\"/\"&填写信息!C189&\"/\"&填写信息!D189)","v":""}]
[{"$f":"IF(TRIM(填写信息!A190)=\"\",\"\",填写信息!A190&\"/\"&填写信息!B190&\"/\"&填写信息!C190&\"/\"&填写信息!D190)","v":""}]
[{"$f":"IF(TRIM(填写信息!A191)=\"\",\"\",填写信息!A191&\"/\"&填写信息!B191&\"/\"&填写信息!C191&\"/\"&填写信息!D191)","v":""}]
[{"$f":"IF(TRIM(填写信息!A192)=\"\",\"\",填写信息!A192&\"/\"&填写信息!B192&\"/\"&填写信息!C192&\"/\"&填写信息!D192)","v":""}]
[{"$f":"IF(TRIM(填写信息!A193)=\"\",\"\",填写信息!A193&\"/\"&填写信息!B193&\"/\"&填写信息!C193&\"/\"&填写信息!D193)","v":""}]
[{"$f":"IF(TRIM(填写信息!A194)=\"\",\"\",填写信息!A194&\"/\"&填写信息!B194&\"/\"&填写信息!C194&\"/\"&填写信息!D194)","v":""}]
[{"$f":"IF(TRIM(填写信息!A195)=\"\",\"\",填写信息!A195&\"/\"&填写信息!B195&\"/\"&填写信息!C195&\"/\"&填写信息!D195)","v":""}]
[{"$f":"IF(TRIM(填写信息!A196)=\"\",\"\",填写信息!A196&\"/\"&填写信息!B196&\"/\"&填写信息!C196&\"/\"&填写信息!D196)","v":""}]
[{"$f":"IF(TRIM(填写信息!A197)=\"\",\"\",填写信息!A197&\"/\"&填写信息!B197&\"/\"&填写信息!C197&\"/\"&填写信息!D197)","v":""}]
[{"$f":"IF(TRIM(填写信息!A198)=\"\",\"\",填写信息!A198&\"/\"&填写信息!B198&\"/\"&填写信息!C198&\"/\"&填写信息!D198)","v":""}]
[{"$f":"IF(TRIM(填写信息!A199)=\"\",\"\",填写信息!A199&\"/\"&填写信息!B199&\"/\"&填写信息!C199&\"/\"&填写信息!D199)","v":""}]
[{"$f":"IF(TRIM(填写信息!A200)=\"\",\"\",填写信息!A200&\"/\"&填写信息!B200&\"/\"&填写信息!C200&\"/\"&填写信息!D200)","v":""}]
[{"$f":"IF(TRIM(填写信息!A201)=\"\",\"\",填写信息!A201&\"/\"&填写信息!B201&\"/\"&填写信息!C201&\"/\"&填写信息!D201)","v":""}]
[{"$f":"IF(TRIM(填写信息!A202)=\"\",\"\",填写信息!A202&\"/\"&填写信息!B202&\"/\"&填写信息!C202&\"/\"&填写信息!D202)","v":""}]
[{"$f":"IF(TRIM(填写信息!A203)=\"\",\"\",填写信息!A203&\"/\"&填写信息!B203&\"/\"&填写信息!C203&\"/\"&填写信息!D203)","v":""}]
[{"$f":"IF(TRIM(填写信息!A204)=\"\",\"\",填写信息!A204&\"/\"&填写信息!B204&\"/\"&填写信息!C204&\"/\"&填写信息!D204)","v":""}]
[{"$f":"IF(TRIM(填写信息!A205)=\"\",\"\",填写信息!A205&\"/\"&填写信息!B205&\"/\"&填写信息!C205&\"/\"&填写信息!D205)","v":""}]
[{"$f":"IF(TRIM(填写信息!A206)=\"\",\"\",填写信息!A206&\"/\"&填写信息!B206&\"/\"&填写信息!C206&\"/\"&填写信息!D206)","v":""}]
[{"$f":"IF(TRIM(填写信息!A207)=\"\",\"\",填写信息!A207&\"/\"&填写信息!B207&\"/\"&填写信息!C207&\"/\"&填写信息!D207)","v":""}]
[{"$f":"IF(TRIM(填写信息!A208)=\"\",\"\",填写信息!A208&\"/\"&填写信息!B208&\"/\"&填写信息!C208&\"/\"&填写信息!D208)","v":""}]
[{"$f":"IF(TRIM(填写信息!A209)=\"\",\"\",填写信息!A209&\"/\"&填写信息!B209&\"/\"&填写信息!C209&\"/\"&填写信息!D209)","v":""}]
[{"$f":"IF(TRIM(填写信息!A210)=\"\",\"\",填写信息!A210&\"/\"&填写信息!B210&\"/\"&填写信息!C210&\"/\"&填写信息!D210)","v":""}]
[{"$f":"IF(TRIM(填写信息!A211)=\"\",\"\",填写信息!A211&\"/\"&填写信息!B211&\"/\"&填写信息!C211&\"/\"&填写信息!D211)","v":""}]
[{"$f":"IF(TRIM(填写信息!A212)=\"\",\"\",填写信息!A212&\"/\"&填写信息!B212&\"/\"&填写信息!C212&\"/\"&填写信息!D212)","v":""}]
[{"$f":"IF(TRIM(填写信息!A213)=\"\",\"\",填写信息!A213&\"/\"&填写信息!B213&\"/\"&填写信息!C213&\"/\"&填写信息!D213)","v":""}]
[{"$f":"IF(TRIM(填写信息!A214)=\"\",\"\",填写信息!A214&\"/\"&填写信息!B214&\"/\"&填写信息!C214&\"/\"&填写信息!D214)","v":""}]
[{"$f":"IF(TRIM(填写信息!A215)=\"\",\"\",填写信息!A215&\"/\"&填写信息!B215&\"/\"&填写信息!C215&\"/\"&填写信息!D215)","v":""}]
[{"$f":"IF(TRIM(填写信息!A216)=\"\",\"\",填写信息!A216&\"/\"&填写信息!B216&\"/\"&填写信息!C216&\"/\"&填写信息!D216)","v":""}]
[{"$f":"IF(TRIM(填写信息!A217)=\"\",\"\",填写信息!A217&\"/\"&填写信息!B217&\"/\"&填写信息!C217&\"/\"&填写信息!D217)","v":""}]
[{"$f":"IF(TRIM(填写信息!A218)=\"\",\"\",填写信息!A218&\"/\"&填写信息!B218&\"/\"&填写信息!C218&\"/\"&填写信息!D218)","v":""}]
[{"$f":"IF(TRIM(填写信息!A219)=\"\",\"\",填写信息!A219&\"/\"&填写信息!B219&\"/\"&填写信息!C219&\"/\"&填写信息!D219)","v":""}]
[{"$f":"IF(TRIM(填写信息!A220)=\"\",\"\",填写信息!A220&\"/\"&填写信息!B220&\"/\"&填写信息!C220&\"/\"&填写信息!D220)","v":""}]
[{"$f":"IF(TRIM(填写信息!A221)=\"\",\"\",填写信息!A221&\"/\"&填写信息!B221&\"/\"&填写信息!C221&\"/\"&填写信息!D221)","v":""}]
[{"$f":"IF(TRIM(填写信息!A222)=\"\",\"\",填写信息!A222&\"/\"&填写信息!B222&\"/\"&填写信息!C222&\"/\"&填写信息!D222)","v":""}]
[{"$f":"IF(TRIM(填写信息!A223)=\"\",\"\",填写信息!A223&\"/\"&填写信息!B223&\"/\"&填写信息!C223&\"/\"&填写信息!D223)","v":""}]
[{"$f":"IF(TRIM(填写信息!A224)=\"\",\"\",填写信息!A224&\"/\"&填写信息!B224&\"/\"&填写信息!C224&\"/\"&填写信息!D224)","v":""}]
[{"$f":"IF(TRIM(填写信息!A225)=\"\",\"\",填写信息!A225&\"/\"&填写信息!B225&\"/\"&填写信息!C225&\"/\"&填写信息!D225)","v":""}]
[{"$f":"IF(TRIM(填写信息!A226)=\"\",\"\",填写信息!A226&\"/\"&填写信息!B226&\"/\"&填写信息!C226&\"/\"&填写信息!D226)","v":""}]
[{"$f":"IF(TRIM(填写信息!A227)=\"\",\"\",填写信息!A227&\"/\"&填写信息!B227&\"/\"&填写信息!C227&\"/\"&填写信息!D227)","v":""}]
[{"$f":"IF(TRIM(填写信息!A228)=\"\",\"\",填写信息!A228&\"/\"&填写信息!B228&\"/\"&填写信息!C228&\"/\"&填写信息!D228)","v":""}]
[{"$f":"IF(TRIM(填写信息!A229)=\"\",\"\",填写信息!A229&\"/\"&填写信息!B229&\"/\"&填写信息!C229&\"/\"&填写信息!D229)","v":""}]
[{"$f":"IF(TRIM(填写信息!A230)=\"\",\"\",填写信息!A230&\"/\"&填写信息!B230&\"/\"&填写信息!C230&\"/\"&填写信息!D230)","v":""}]
[{"$f":"IF(TRIM(填写信息!A231)=\"\",\"\",填写信息!A231&\"/\"&填写信息!B231&\"/\"&填写信息!C231&\"/\"&填写信息!D231)","v":""}]
[{"$f":"IF(TRIM(填写信息!A232)=\"\",\"\",填写信息!A232&\"/\"&填写信息!B232&\"/\"&填写信息!C232&\"/\"&填写信息!D232)","v":""}]
[{"$f":"IF(TRIM(填写信息!A233)=\"\",\"\",填写信息!A233&\"/\"&填写信息!B233&\"/\"&填写信息!C233&\"/\"&填写信息!D233)","v":""}]
[{"$f":"IF(TRIM(填写信息!A234)=\"\",\"\",填写信息!A234&\"/\"&填写信息!B234&\"/\"&填写信息!C234&\"/\"&填写信息!D234)","v":""}]
[{"$f":"IF(TRIM(填写信息!A235)=\"\",\"\",填写信息!A235&\"/\"&填写信息!B235&\"/\"&填写信息!C235&\"/\"&填写信息!D235)","v":""}]
[{"$f":"IF(TRIM(填写信息!A236)=\"\",\"\",填写信息!A236&\"/\"&填写信息!B236&\"/\"&填写信息!C236&\"/\"&填写信息!D236)","v":""}]
[{"$f":"IF(TRIM(填写信息!A237)=\"\",\"\",填写信息!A237&\"/\"&填写信息!B237&\"/\"&填写信息!C237&\"/\"&填写信息!D237)","v":""}]
[{"$f":"IF(TRIM(填写信息!A238)=\"\",\"\",填写信息!A238&\"/\"&填写信息!B238&\"/\"&填写信息!C238&\"/\"&填写信息!D238)","v":""}]

{"sheet":"EXT01","index":7,"n_rows":0,"n_cols":0,"rows_kept":0,"cut":false,"hidden":false,"merged":[]}

{"sheet":"EXT02","index":8,"n_rows":0,"n_cols":0,"rows_kept":0,"cut":false,"hidden":false,"merged":[]}

{"sheet":"EXT03","index":9,"n_rows":0,"n_cols":0,"rows_kept":0,"cut":false,"hidden":false,"merged":[]}